program: Orca
programVersion: 5.0.2
elementType: S S S P O O C C C C C C C C C H H H H H H H H H H H H H H H H H H H H H
charge: 0
multiplicity: 1
keywords: wb97x-d3
keywords: def2-TZVPP
keywords: def2/J RIJCOSX
keywords: DEFGRID2
keywords: scfconv7
keywords: smallprint printgap noloewdin
keywords: NOSOSCF
formula: C9H21O2PS3
InChI: InChI=1/C9H21O2PS3/c1-6-10-12(13,11-7-2)15-8-14-9(3,4)5/h6-8H2,1-5H3
36 atoms
S  3.130641 -0.117659 -0.6240
S  0.672455 1.446488 0.327179
S  -1.758385 0.10377 -1.663953
P  -1.242786 0.669871 0.105608
O  -1.31891 -0.442142 1.251813
O  -2.124694 1.833758 0.768672
C  2.65128 -1.751867 0.080812
C  3.957671 -2.544391 0.042164
C  2.177533 -1.611862 1.523132
C  1.598611 -2.437732 -0.777416
C  1.59826 0.695195 -1.069786
C  -2.466888 -1.299791 1.363025
C  -2.577973 2.94883 -0.010451
C  -2.128299 -2.694717 0.895165
C  -4.036488 2.784974 -0.368409
H  4.745891 -2.049069 0.611674
H  3.801242 -3.529136 0.486927
H  4.313929 -2.68614 -0.978411
H  1.256097 -1.03982 1.599851
H  2.929967 -1.119178 2.138268
H  1.98999 -2.602412 1.94672
H  0.636614 -1.924359 -0.748884
H  1.914988 -2.511156 -1.81828
H  1.427276 -3.450677 -0.405355
H  1.889194 1.516828 -1.72264
H  0.92419 0.058318 -1.642526
H  -2.746957 -1.29059 2.416627
H  -3.309519 -0.900166 0.793138
H  -2.418606 3.83266 0.607363
H  -1.970868 3.062268 -0.912524
H  -1.90103 -2.703749 -0.170069
H  -1.272845 -3.09641 1.438216
H  -2.977355 -3.357135 1.066553
H  -4.38845 3.669499 -0.899936
H  -4.184077 1.921469 -1.015817
H  -4.650718 2.663821 0.523603
totalener: -2042.18021700 hartree
nucrepener: 1720.45325062 hartree
electener: -3762.63346762 hartree
oneelecener: -6235.63342450 hartree
twoeener: 2472.99995688 hartree
kineticenergy: 2037.00465166 hartree
xcener: -124.863997785993 hartree
chargesum: 0.0000000
charge: -0.116316 -0.125317 -0.407526 0.610410 -0.307298 -0.336569 0.158360 -0.278467 -0.294368 -0.293198 -0.139308 0.029717 0.028835 -0.238802 -0.232485 0.102380 0.083480 0.102630 0.090935 0.097437 0.080480 0.050493 0.109101 0.088250 0.149731 0.118803 0.096174 0.080268 0.097306 0.080503 0.085633 0.085071 0.091968 0.082363 0.084830 0.084495
qa: -0.1163 -0.1253 -0.4075 0.6104 -0.3073 -0.3366 0.1584 -0.2785 -0.2944 -0.2932 -0.1393 0.0297 0.0288 -0.2388 -0.2325 0.1024 0.0835 0.1026 0.0909 0.0974 0.0805 0.0505 0.1091 0.0883 0.1497 0.1188 0.0962 0.0803 0.0973 0.0805 0.0856 0.0851 0.0920 0.0824 0.0848 0.0845
va: 2.2654 2.3257 2.0192 5.4372 2.1017 2.1141 3.9171 3.8752 3.9097 3.9198 4.0202 3.8994 3.8896 3.9207 3.9293 1.0107 1.0066 1.0158 1.0344 1.0200 1.0064 1.0293 1.0175 1.0077 0.9970 1.0496 0.9963 1.0098 0.9938 1.0137 1.0135 1.0015 1.0149 1.0123 1.0209 1.0040
dispcorr: -0.019221509 hartree
energy: -2042.199438506977
dipole: -1.26400 0.57938 -0.68462 -15.34243 15.09945 -0.24299 3.34678 -2.94771 0.39908
magnitude: 0.82886 au
magnitude: 2.10680 debye
