program: Orca
programVersion: 5.0.2
elementType: S S S P O O C C C C C C C C C H H H H H H H H H H H H H H H H H H H H H
charge: 0
multiplicity: 1
keywords: wb97x-d3
keywords: def2-TZVPP
keywords: def2/J RIJCOSX
keywords: DEFGRID2
keywords: scfconv7
keywords: smallprint printgap noloewdin
keywords: NOSOSCF
formula: C9H21O2PS3
InChI: InChI=1/C9H21O2PS3/c1-6-10-12(13,11-7-2)15-8-14-9(3,4)5/h6-8H2,1-5H3
36 atoms
S  3.083272 0.315195 0.671547
S  0.124156 0.085476 1.198383
S  -1.228179 0.245309 -1.940453
P  -1.507724 0.435501 -0.0412
O  -2.609864 -0.535314 0.602676
O  -1.995156 1.875145 0.454324
C  3.216146 -1.326896 -0.165393
C  2.564218 -1.311771 -1.539831
C  4.724015 -1.535259 -0.300913
C  2.620089 -2.426141 0.708294
C  1.452326 0.930764 0.258682
C  -2.892091 -1.834042 0.067827
C  -3.00756 2.611895 -0.244445
C  -1.785096 -2.833194 0.320651
C  -2.718548 4.085708 -0.094034
H  2.774501 -2.254514 -2.050417
H  1.479038 -1.212849 -1.487856
H  2.951732 -0.503968 -2.161629
H  5.17523 -0.787862 -0.953504
H  4.921701 -2.521663 -0.725478
H  5.227823 -1.489329 0.66632
H  2.792741 -3.402338 0.247402
H  3.076978 -2.435709 1.697675
H  1.54609 -2.301673 0.836136
H  1.456465 1.98505 0.531403
H  1.239746 0.853735 -0.807589
H  -3.811929 -2.142733 0.563511
H  -3.09385 -1.74988 -1.002455
H  -3.016416 2.328864 -1.300258
H  -3.97867 2.354566 0.184088
H  -2.111969 -3.820736 -0.006399
H  -0.882165 -2.583244 -0.236022
H  -1.53234 -2.894858 1.378799
H  -2.693163 4.38406 0.953457
H  -1.764849 4.347054 -0.551284
H  -3.498279 4.664203 -0.589521
totalener: -2042.18139770 hartree
nucrepener: 1699.82114813 hartree
electener: -3742.00254584 hartree
oneelecener: -6194.39774360 hartree
twoeener: 2452.39519776 hartree
kineticenergy: 2037.00422885 hartree
xcener: -124.864818042358 hartree
chargesum: -0.0000000
charge: -0.118650 -0.120985 -0.414924 0.618982 -0.333175 -0.311945 0.140227 -0.279746 -0.278309 -0.274412 -0.147797 0.029305 0.017042 -0.244339 -0.223667 0.089607 0.060538 0.102876 0.101805 0.083735 0.100766 0.085232 0.097365 0.070700 0.153753 0.120406 0.095598 0.092954 0.085291 0.095933 0.089756 0.073941 0.096123 0.087646 0.082172 0.076195
qa: -0.1187 -0.1210 -0.4149 0.6190 -0.3332 -0.3119 0.1402 -0.2797 -0.2783 -0.2744 -0.1478 0.0293 0.0170 -0.2443 -0.2237 0.0896 0.0605 0.1029 0.1018 0.0837 0.1008 0.0852 0.0974 0.0707 0.1538 0.1204 0.0956 0.0930 0.0853 0.0959 0.0898 0.0739 0.0961 0.0876 0.0822 0.0762
va: 2.2659 2.3166 2.0259 5.4300 2.1138 2.1355 3.9150 3.9054 3.8950 3.9215 4.0135 3.8834 3.8746 3.9057 3.9461 1.0104 1.0371 1.0122 1.0161 1.0066 1.0093 1.0065 1.0173 1.0314 0.9980 1.0402 0.9911 1.0125 1.0141 0.9931 1.0169 1.0050 1.0012 1.0050 1.0089 1.0096
dispcorr: -0.017822050 hartree
energy: -2042.199219754499
dipole: 7.12476 -7.67096 -0.54620 -9.17768 8.86130 -0.31639 -4.24315 4.14298 -0.10018
magnitude: 0.63912 au
magnitude: 1.62450 debye
