program: Orca
programVersion: 5.0.2
elementType: S S S P O O C C C C C C C C C H H H H H H H H H H H H H H H H H H H H H
charge: 0
multiplicity: 1
keywords: wb97x-d3
keywords: def2-TZVPP
keywords: def2/J RIJCOSX
keywords: DEFGRID2
keywords: scfconv7
keywords: smallprint printgap noloewdin
keywords: NOSOSCF
formula: C9H21O2PS3
InChI: InChI=1/C9H21O2PS3/c1-6-10-12(13,11-7-2)15-8-14-9(3,4)5/h6-8H2,1-5H3
36 atoms
S  1.708193 -0.7385 1.286176
S  0.683307 0.807447 -1.199899
S  -2.487182 0.8537 -2.10456
P  -1.306298 0.845695 -0.59622
O  -1.472228 -0.351531 0.458284
O  -1.358158 2.08869 0.410998
C  3.206366 -1.53332 0.573816
C  3.226436 -2.912275 1.230842
C  3.101053 -1.676453 -0.938573
C  4.457698 -0.75262 0.959255
C  1.574387 0.819887 0.40209
C  -1.470995 -1.709238 0.007643
C  -2.534445 2.89565 0.555736
C  -1.639006 -2.602904 1.210889
C  -3.635573 2.186724 1.31133
H  4.104129 -3.468367 0.895758
H  3.27404 -2.840116 2.318539
H  2.341541 -3.493004 0.967139
H  3.121126 -0.713038 -1.448809
H  2.18368 -2.185687 -1.232231
H  3.948765 -2.255694 -1.313429
H  4.551215 -0.660033 2.040752
H  5.348827 -1.260047 0.581708
H  4.462525 0.252415 0.534735
H  1.093981 1.533758 1.068762
H  2.562586 1.221678 0.175886
H  -2.281368 -1.851802 -0.71225
H  -0.524859 -1.922691 -0.497845
H  -2.19874 3.781799 1.093533
H  -2.883829 3.20972 -0.430673
H  -0.819088 -2.466448 1.914544
H  -2.578265 -2.403823 1.726695
H  -1.645619 -3.645738 0.892849
H  -4.460857 2.878859 1.481686
H  -4.024654 1.341127 0.744884
H  -3.288323 1.827763 2.279583
totalener: -2042.18176125 hartree
nucrepener: 1717.13174653 hartree
electener: -3759.31350778 hartree
oneelecener: -6229.07677805 hartree
twoeener: 2469.76327027 hartree
kineticenergy: 2037.00945381 hartree
xcener: -124.865997563216 hartree
chargesum: 0.0000000
charge: -0.121337 -0.126853 -0.385130 0.605998 -0.304373 -0.328840 0.145998 -0.278861 -0.307858 -0.295973 -0.177168 -0.004366 0.006643 -0.224609 -0.218709 0.087656 0.104778 0.099924 0.082493 0.106887 0.095034 0.100215 0.089334 0.087383 0.156406 0.129008 0.112963 0.082719 0.091534 0.093453 0.082939 0.087203 0.074652 0.082249 0.081774 0.086833
qa: -0.1213 -0.1269 -0.3851 0.6060 -0.3044 -0.3288 0.1460 -0.2789 -0.3079 -0.2960 -0.1772 -0.0044 0.0066 -0.2246 -0.2187 0.0877 0.1048 0.0999 0.0825 0.1069 0.0950 0.1002 0.0893 0.0874 0.1564 0.1290 0.1130 0.0827 0.0915 0.0935 0.0829 0.0872 0.0747 0.0822 0.0818 0.0868
va: 2.2587 2.3020 2.0742 5.4315 2.0769 2.1061 3.9059 3.8799 3.9515 3.9315 4.0364 3.8636 3.9147 3.9356 3.8755 1.0074 1.0108 1.0127 1.0028 1.0061 1.0091 1.0154 1.0061 1.0086 1.0169 1.0126 1.0158 1.0034 0.9918 1.0125 1.0154 1.0081 1.0074 1.0118 1.0275 1.0076
dispcorr: -0.018157446 hartree
energy: -2042.199918700220
dipole: 12.71554 -11.81848 0.89706 -13.51159 13.19636 -0.31523 12.37415 -11.41002 0.96413
magnitude: 1.35411 au
magnitude: 3.44189 debye
