program: Orca
programVersion: 5.0.2
elementType: S S S P O O C C C C C C C C C H H H H H H H H H H H H H H H H H H H H H
charge: 0
multiplicity: 1
keywords: wb97x-d3
keywords: def2-TZVPP
keywords: def2/J RIJCOSX
keywords: DEFGRID2
keywords: scfconv7
keywords: smallprint printgap noloewdin
keywords: NOSOSCF
formula: C9H21O2PS3
InChI: InChI=1/C9H21O2PS3/c1-6-10-12(13,11-7-2)15-8-14-9(3,4)5/h6-8H2,1-5H3
36 atoms
S  1.862851 -1.078295 0.779664
S  0.261688 1.344502 1.351162
S  -0.715308 0.522182 -1.810992
P  -1.180067 0.551301 0.056742
O  -1.594887 -0.829561 0.73087
O  -2.436626 1.45715 0.471285
C  3.131631 -1.572584 -0.457778
C  4.426404 -0.800214 -0.238168
C  3.354385 -3.057856 -0.182315
C  2.610668 -1.376918 -1.875717
C  1.75868 0.712239 0.551664
C  -1.8519 -2.020073 -0.020224
C  -2.561266 2.80244 -0.00147
C  -3.247456 -2.022948 -0.600267
C  -3.993437 3.241989 0.188704
H  5.200452 -1.166315 -0.916991
H  4.306069 0.26567 -0.437551
H  4.7899 -0.915757 0.78301
H  2.433473 -3.629826 -0.304168
H  3.728838 -3.227769 0.82768
H  4.088025 -3.457647 -0.884968
H  3.35286 -1.727752 -2.597266
H  1.686347 -1.929617 -2.037902
H  2.404464 -0.33123 -2.102717
H  2.587092 1.232737 1.033071
H  1.731057 0.980738 -0.504983
H  -1.099125 -2.131456 -0.803359
H  -1.717811 -2.833376 0.691934
H  -1.876923 3.445892 0.559044
H  -2.276516 2.851559 -1.056172
H  -3.362016 -1.246231 -1.356069
H  -3.445454 -2.983387 -1.077384
H  -3.998378 -1.869241 0.174076
H  -4.290415 3.195443 1.236173
H  -4.105574 4.272849 -0.147082
H  -4.676345 2.622391 -0.391941
totalener: -2042.18134717 hartree
nucrepener: 1718.50658331 hartree
electener: -3760.68793048 hartree
oneelecener: -6232.06370152 hartree
twoeener: 2471.37577104 hartree
kineticenergy: 2037.01053070 hartree
xcener: -124.867586149512 hartree
chargesum: 0.0000000
charge: -0.122977 -0.139575 -0.414338 0.629952 -0.305218 -0.324817 0.151147 -0.305675 -0.274849 -0.296339 -0.145237 0.045656 0.023106 -0.229904 -0.228293 0.089530 0.082468 0.102777 0.099180 0.103824 0.084299 0.090870 0.095388 0.088495 0.134347 0.124135 0.074287 0.098103 0.084655 0.089066 0.081522 0.079719 0.089314 0.086060 0.075359 0.083962
qa: -0.1230 -0.1396 -0.4143 0.6300 -0.3052 -0.3248 0.1511 -0.3057 -0.2748 -0.2963 -0.1452 0.0457 0.0231 -0.2299 -0.2283 0.0895 0.0825 0.1028 0.0992 0.1038 0.0843 0.0909 0.0954 0.0885 0.1343 0.1241 0.0743 0.0981 0.0847 0.0891 0.0815 0.0797 0.0893 0.0861 0.0754 0.0840
va: 2.2332 2.3141 2.0222 5.4306 2.1272 2.1321 3.9126 3.9235 3.8763 3.9585 4.0203 3.8723 3.8810 3.9287 3.9586 1.0084 1.0041 1.0129 1.0130 1.0132 1.0074 1.0100 1.0100 1.0090 0.9982 1.0310 1.0183 0.9912 0.9954 1.0080 1.0208 1.0110 1.0065 1.0053 1.0079 1.0080
dispcorr: -0.017383606 hartree
energy: -2042.198730780857
dipole: 6.51822 -6.28297 0.23524 -8.20480 8.20042 -0.00437 -8.14287 7.93086 -0.21201
magnitude: 0.31671 au
magnitude: 0.80502 debye
