program: Orca
programVersion: 5.0.2
elementType: S S S P O O C C C C C C C C C H H H H H H H H H H H H H H H H H H H H H
charge: 0
multiplicity: 1
keywords: wb97x-d3
keywords: def2-TZVPP
keywords: def2/J RIJCOSX
keywords: DEFGRID2
keywords: scfconv7
keywords: smallprint printgap noloewdin
keywords: NOSOSCF
formula: C9H21O2PS3
InChI: InChI=1/C9H21O2PS3/c1-6-10-12(13,11-7-2)15-8-14-9(3,4)5/h6-8H2,1-5H3
36 atoms
S  2.768379 -1.5527 -0.394167
S  -0.126934 -1.517436 0.638107
S  -1.466793 0.61281 -1.68409
P  -1.381133 0.075706 0.167239
O  -2.76624 -0.389055 0.827893
O  -0.927732 1.196033 1.212861
C  3.184769 0.216011 -0.082717
C  4.711005 0.234816 -0.170626
C  2.592046 1.126565 -1.148446
C  2.743557 0.643845 1.311802
C  1.02312 -1.591813 -0.793294
C  -3.645954 -1.282595 0.134258
C  -1.457692 2.529925 1.126471
C  -4.836684 -0.529488 -0.411196
C  -0.444233 3.46556 0.510992
H  5.076794 1.239765 0.049208
H  5.165177 -0.444995 0.552215
H  5.061185 -0.042649 -1.165115
H  2.967739 2.143025 -1.008778
H  1.504081 1.180762 -1.096218
H  2.86797 0.80197 -2.152185
H  1.662254 0.622838 1.426338
H  3.172531 -0.003329 2.076125
H  3.079035 1.666205 1.506906
H  0.732687 -0.832069 -1.519162
H  0.859535 -2.561091 -1.261772
H  -3.117162 -1.801241 -0.670175
H  -3.951432 -2.033559 0.863288
H  -2.388334 2.543167 0.55335
H  -1.696786 2.820624 2.149449
H  -5.533688 -1.226979 -0.876563
H  -5.367714 -0.00426 0.38235
H  -4.52767 0.194019 -1.164406
H  0.495524 3.44742 1.062629
H  -0.246394 3.198343 -0.52596
H  -0.827338 4.486313 0.529944
totalener: -2042.18033281 hartree
nucrepener: 1721.63238377 hartree
electener: -3763.81271657 hartree
oneelecener: -6237.99907607 hartree
twoeener: 2474.18635950 hartree
kineticenergy: 2037.00093951 hartree
xcener: -124.863705496960 hartree
chargesum: -0.0000000
charge: -0.115557 -0.125635 -0.408027 0.613088 -0.334513 -0.309129 0.158953 -0.279507 -0.290538 -0.294721 -0.143777 0.027632 0.033316 -0.230020 -0.241598 0.084039 0.102369 0.102506 0.088055 0.051199 0.107639 0.086793 0.098262 0.080951 0.121680 0.149541 0.077688 0.097836 0.082528 0.095433 0.081734 0.084270 0.084492 0.084978 0.086097 0.091944
qa: -0.1156 -0.1256 -0.4080 0.6131 -0.3345 -0.3091 0.1590 -0.2795 -0.2905 -0.2947 -0.1438 0.0276 0.0333 -0.2300 -0.2416 0.0840 0.1024 0.1025 0.0881 0.0512 0.1076 0.0868 0.0983 0.0810 0.1217 0.1495 0.0777 0.0978 0.0825 0.0954 0.0817 0.0843 0.0845 0.0850 0.0861 0.0919
va: 2.2642 2.3215 2.0189 5.4323 2.1166 2.1062 3.9153 3.8768 3.9114 3.9136 4.0183 3.8958 3.8935 3.9346 3.9207 1.0064 1.0106 1.0156 1.0086 1.0376 1.0173 1.0327 1.0210 1.0057 1.0514 0.9965 1.0132 0.9936 1.0094 0.9962 1.0117 1.0042 1.0200 1.0017 1.0135 1.0151
dispcorr: -0.019249929 hartree
energy: -2042.199582738665
dipole: 6.65133 -7.13326 -0.48194 13.82097 -13.27155 0.54941 -0.15972 0.40326 0.24353
magnitude: 0.77034 au
magnitude: 1.95806 debye
