program: Orca
programVersion: 5.0.2
elementType: S S S P O O C C C C C C C C C H H H H H H H H H H H H H H H H H H H H H
charge: 0
multiplicity: 1
keywords: wb97x-d3
keywords: def2-TZVPP
keywords: def2/J RIJCOSX
keywords: DEFGRID2
keywords: scfconv7
keywords: smallprint printgap noloewdin
keywords: NOSOSCF
formula: C9H21O2PS3
InChI: InChI=1/C9H21O2PS3/c1-6-10-12(13,11-7-2)15-8-14-9(3,4)5/h6-8H2,1-5H3
36 atoms
S  1.577038 -1.706305 0.027666
S  -0.164608 -0.256375 1.939123
S  -0.257275 1.706306 -0.868505
P  -1.27307 0.750822 0.457676
O  -2.352387 -0.311237 -0.062757
O  -2.202759 1.632796 1.41324
C  3.136478 -1.386113 -0.896172
C  4.324313 -1.362685 0.057834
C  3.249652 -2.576412 -1.846398
C  3.046221 -0.091373 -1.693183
C  1.479074 -0.318562 1.180139
C  -2.034911 -1.575283 -0.653467
C  -2.765798 2.878804 0.987079
C  -1.58132 -1.469913 -2.09153
C  -3.866152 2.699622 -0.034601
H  5.254834 -1.251563 -0.504114
H  4.271342 -0.52701 0.75699
H  4.386472 -2.284518 0.635776
H  2.405167 -2.618128 -2.535224
H  3.295796 -3.521995 -1.305106
H  4.160265 -2.486602 -2.441555
H  2.952427 0.786239 -1.054381
H  3.952285 0.039038 -2.290009
H  2.189718 -0.097639 -2.365385
H  2.169896 -0.438612 2.01479
H  1.674707 0.632869 0.685271
H  -1.281469 -2.085478 -0.047679
H  -2.958323 -2.149863 -0.581708
H  -3.149428 3.334252 1.899255
H  -1.974127 3.521777 0.594809
H  -0.615012 -0.976713 -2.172447
H  -1.482094 -2.474859 -2.503315
H  -2.303589 -0.925341 -2.698707
H  -4.638537 2.022104 0.327461
H  -4.330041 3.664675 -0.240839
H  -3.477313 2.312264 -0.976029
totalener: -2042.17798265 hartree
nucrepener: 1727.50815535 hartree
electener: -3769.68613800 hartree
oneelecener: -6250.02494153 hartree
twoeener: 2480.33880353 hartree
kineticenergy: 2037.00067825 hartree
xcener: -124.868531928266 hartree
chargesum: 0.0000000
charge: -0.149916 -0.133838 -0.406406 0.629348 -0.300937 -0.324742 0.156273 -0.298883 -0.276780 -0.301346 -0.137011 0.004789 0.007361 -0.212531 -0.226318 0.089393 0.083321 0.101245 0.101261 0.103314 0.085449 0.089487 0.092848 0.102547 0.137826 0.121306 0.087136 0.099480 0.093991 0.091951 0.061572 0.082848 0.091492 0.088577 0.082005 0.083887
qa: -0.1499 -0.1338 -0.4064 0.6293 -0.3009 -0.3247 0.1563 -0.2989 -0.2768 -0.3013 -0.1370 0.0048 0.0074 -0.2125 -0.2263 0.0894 0.0833 0.1012 0.1013 0.1033 0.0854 0.0895 0.0928 0.1025 0.1378 0.1213 0.0871 0.0995 0.0940 0.0920 0.0616 0.0828 0.0915 0.0886 0.0820 0.0839
va: 2.2382 2.3081 2.0312 5.4081 2.1190 2.1442 3.9155 3.9239 3.8775 3.9582 4.0026 3.9065 3.9182 3.8814 3.8844 1.0081 1.0057 1.0135 1.0115 1.0124 1.0075 1.0078 1.0098 1.0047 0.9998 1.0371 1.0080 0.9921 0.9910 1.0109 1.0335 1.0122 1.0101 1.0076 1.0113 1.0222
dispcorr: -0.018536862 hartree
energy: -2042.196519512257
dipole: 11.20127 -10.92524 0.27604 -5.31723 5.15836 -0.15887 -14.05646 13.85085 -0.20562
magnitude: 0.37910 au
magnitude: 0.96358 debye
