program: Orca
programVersion: 5.0.2
elementType: S S S P O O C C C C C C C C C H H H H H H H H H H H H H H H H H H H H H
charge: 0
multiplicity: 1
keywords: wb97x-d3
keywords: def2-TZVPP
keywords: def2/J RIJCOSX
keywords: DEFGRID2
keywords: scfconv7
keywords: smallprint printgap noloewdin
keywords: NOSOSCF
formula: C9H21O2PS3
InChI: InChI=1/C9H21O2PS3/c1-6-10-12(13,11-7-2)15-8-14-9(3,4)5/h6-8H2,1-5H3
36 atoms
S  1.91665 0.188899 1.400891
S  0.287589 -1.316926 -0.788847
S  -2.436696 -0.11118 -2.208641
P  -1.521734 -0.318299 -0.53863
O  -2.247855 -1.154776 0.617799
O  -1.175933 1.019443 0.276196
C  3.507304 0.123286 0.469379
C  3.330653 0.651088 -0.950418
C  4.418385 1.060847 1.26016
C  4.095873 -1.280322 0.454252
C  1.001252 -1.271302 0.899295
C  -3.676923 -1.264187 0.681689
C  -0.542937 2.113317 -0.397654
C  -4.341281 0.020744 1.121223
C  -0.350806 3.232577 0.59423
H  4.293567 0.658786 -1.467818
H  2.643014 0.039158 -1.53199
H  2.946969 1.671537 -0.944274
H  4.599051 0.689677 2.268965
H  3.992966 2.062854 1.338815
H  5.381125 1.152876 0.753366
H  4.171569 -1.697007 1.459158
H  3.514786 -1.966122 -0.163731
H  5.101071 -1.249933 0.028267
H  1.622195 -2.163416 0.968844
H  0.202739 -1.392845 1.629876
H  -4.059746 -1.584153 -0.290073
H  -3.861086 -2.064556 1.397514
H  0.421264 1.785597 -0.795667
H  -1.166347 2.428087 -1.238505
H  -3.933181 0.379223 2.065417
H  -4.227434 0.804014 0.372316
H  -5.409186 -0.152762 1.257765
H  -1.302853 3.572489 1.000882
H  0.290097 2.91866 1.416801
H  0.12321 4.079604 0.09773
totalener: -2042.18141049 hartree
nucrepener: 1719.00913526 hartree
electener: -3761.19054575 hartree
oneelecener: -6232.78616524 hartree
twoeener: 2471.59561949 hartree
kineticenergy: 2037.00463952 hartree
xcener: -124.865531300940 hartree
chargesum: 0.0000000
charge: -0.121401 -0.135828 -0.385429 0.609669 -0.328670 -0.305521 0.167329 -0.328735 -0.273179 -0.321279 -0.177177 0.008808 -0.009844 -0.217835 -0.223374 0.097441 0.109282 0.087140 0.103469 0.098505 0.085344 0.105142 0.086685 0.093701 0.139214 0.152321 0.093041 0.092329 0.088565 0.115311 0.086638 0.080823 0.082277 0.086465 0.084429 0.074342
qa: -0.1214 -0.1358 -0.3854 0.6097 -0.3287 -0.3055 0.1673 -0.3287 -0.2732 -0.3213 -0.1772 0.0088 -0.0098 -0.2178 -0.2234 0.0974 0.1093 0.0871 0.1035 0.0985 0.0853 0.1051 0.0867 0.0937 0.1392 0.1523 0.0930 0.0923 0.0886 0.1153 0.0866 0.0808 0.0823 0.0865 0.0844 0.0743
va: 2.2685 2.2979 2.0748 5.4289 2.1072 2.0782 3.8755 3.9330 3.8848 3.9271 4.0459 3.9123 3.8682 3.8759 3.9360 1.0112 1.0206 1.0084 1.0148 1.0124 1.0073 1.0106 0.9998 1.0090 1.0009 1.0175 1.0127 0.9917 0.9906 1.0173 1.0078 1.0273 1.0118 1.0076 1.0162 1.0075
dispcorr: -0.018496659 hartree
energy: -2042.199907153071
dipole: 16.00462 -15.23512 0.76950 9.74063 -9.62226 0.11837 9.19462 -8.27218 0.92244
magnitude: 1.20708 au
magnitude: 3.06815 debye
