program: Orca
programVersion: 5.0.2
elementType: S S S P O O C C C C C C C C C H H H H H H H H H H H H H H H H H H H H H
charge: 0
multiplicity: 1
keywords: wb97x-d3
keywords: def2-TZVPP
keywords: def2/J RIJCOSX
keywords: DEFGRID2
keywords: scfconv7
keywords: smallprint printgap noloewdin
keywords: NOSOSCF
formula: C9H21O2PS3
InChI: InChI=1/C9H21O2PS3/c1-6-10-12(13,11-7-2)15-8-14-9(3,4)5/h6-8H2,1-5H3
36 atoms
S  1.77364 -0.807294 1.376802
S  0.77988 0.901039 -1.038905
S  -2.329675 0.907627 -2.169896
P  -1.251432 0.904328 -0.588277
O  -1.469414 -0.302919 0.444665
O  -1.385213 2.146547 0.411874
C  3.09449 -1.63253 0.387113
C  3.647428 -2.693407 1.337378
C  2.499351 -2.303137 -0.846495
C  4.196837 -0.659761 -0.004887
C  1.54962 0.806991 0.623243
C  -1.456054 -1.656747 -0.017301
C  -2.610057 2.879816 0.545614
C  -1.678635 -2.559071 1.170421
C  -3.683167 2.100881 1.272258
H  4.117275 -2.244427 2.212334
H  2.864435 -3.370475 1.683356
H  4.396067 -3.296595 0.819714
H  1.739129 -3.032736 -0.566206
H  3.279985 -2.830575 -1.400839
H  2.039594 -1.581223 -1.519769
H  3.863858 0.065286 -0.748841
H  4.585532 -0.118864 0.858847
H  5.026017 -1.211266 -0.453342
H  0.953416 1.385576 1.327477
H  2.501638 1.326568 0.524203
H  -2.235522 -1.788458 -0.772286
H  -0.491068 -1.871011 -0.484332
H  -2.335998 3.776798 1.100239
H  -2.958079 3.186103 -0.443689
H  -0.886475 -2.433301 1.907202
H  -2.637181 -2.358925 1.648591
H  -1.678295 -3.598998 0.843351
H  -4.021141 1.245347 0.688377
H  -3.332876 1.744763 2.240317
H  -4.545327 2.747079 1.440452
totalener: -2042.18137154 hartree
nucrepener: 1721.46683989 hartree
electener: -3763.64821144 hartree
oneelecener: -6237.67762796 hartree
twoeener: 2474.02941652 hartree
kineticenergy: 2037.01032014 hartree
xcener: -124.866727918484 hartree
chargesum: -0.0000000
charge: -0.123600 -0.137832 -0.382296 0.606908 -0.304521 -0.326639 0.171976 -0.273295 -0.330961 -0.322075 -0.171558 -0.012606 0.005657 -0.224216 -0.217607 0.102004 0.098352 0.085575 0.085963 0.098363 0.107873 0.087605 0.103753 0.094781 0.152109 0.136623 0.115396 0.091697 0.092641 0.093492 0.084530 0.086896 0.074566 0.080810 0.086561 0.083075
qa: -0.1236 -0.1378 -0.3823 0.6069 -0.3045 -0.3266 0.1720 -0.2733 -0.3310 -0.3221 -0.1716 -0.0126 0.0057 -0.2242 -0.2176 0.1020 0.0984 0.0856 0.0860 0.0984 0.1079 0.0876 0.1038 0.0948 0.1521 0.1366 0.1154 0.0917 0.0926 0.0935 0.0845 0.0869 0.0746 0.0808 0.0866 0.0831
va: 2.2674 2.2972 2.0810 5.4345 2.0753 2.1063 3.8645 3.8912 3.9333 3.9294 4.0419 3.8715 3.9154 3.9364 3.8759 1.0154 1.0115 1.0070 1.0078 1.0119 1.0216 0.9998 1.0094 1.0092 1.0185 1.0013 1.0170 0.9869 0.9914 1.0122 1.0168 1.0079 1.0078 1.0261 1.0079 1.0117
dispcorr: -0.018665586 hartree
energy: -2042.200037128903
dipole: 10.69085 -9.98777 0.70309 -14.61471 14.28184 -0.33287 10.73138 -9.79491 0.93647
magnitude: 1.21742 au
magnitude: 3.09443 debye
