program: Orca
programVersion: 5.0.2
elementType: S S S P O O C C C C C C C C C H H H H H H H H H H H H H H H H H H H H H
charge: 0
multiplicity: 1
keywords: wb97x-d3
keywords: def2-TZVPP
keywords: def2/J RIJCOSX
keywords: DEFGRID2
keywords: scfconv7
keywords: smallprint printgap noloewdin
keywords: NOSOSCF
formula: C9H21O2PS3
InChI: InChI=1/C9H21O2PS3/c1-6-10-12(13,11-7-2)15-8-14-9(3,4)5/h6-8H2,1-5H3
36 atoms
S  2.063819 0.029929 -1.004684
S  -0.116133 -1.576315 0.526223
S  -1.657325 0.41743 -1.764562
P  -1.297312 0.087212 0.096605
O  -2.569632 -0.204157 1.029507
O  -0.568345 1.251109 0.911425
C  3.386888 -0.119212 0.267157
C  4.152444 -1.426839 0.116447
C  4.305493 1.059647 -0.053184
C  2.829675 0.026467 1.678205
C  1.074288 -1.459042 -0.857399
C  -3.762911 -0.816866 0.528495
C  -0.590448 2.615057 0.476468
C  -3.602398 -2.295048 0.250326
C  -1.932446 3.271898 0.709575
H  4.535522 -1.552338 -0.896322
H  5.001592 -1.441257 0.803734
H  3.537684 -2.294127 0.360974
H  3.775255 2.010724 0.016562
H  4.730275 0.980314 -1.054464
H  5.130385 1.087946 0.661453
H  3.651928 0.044942 2.398406
H  2.26022 0.94855 1.786415
H  2.169451 -0.796489 1.946048
H  0.510454 -1.524789 -1.787921
H  1.692704 -2.352904 -0.779259
H  -4.506437 -0.649004 1.307124
H  -4.089967 -0.291778 -0.371917
H  0.189657 3.103288 1.059855
H  -0.305717 2.665996 -0.576448
H  -2.922009 -2.476387 -0.580649
H  -3.229587 -2.830051 1.123217
H  -4.572364 -2.716477 -0.015527
H  -1.868606 4.331663 0.461002
H  -2.704849 2.832116 0.078912
H  -2.241797 3.186782 1.750761
totalener: -2042.17964875 hartree
nucrepener: 1741.75948364 hartree
electener: -3783.93913240 hartree
oneelecener: -6278.69124273 hartree
twoeener: 2494.75211034 hartree
kineticenergy: 2037.01995087 hartree
xcener: -124.870269663911 hartree
chargesum: -0.0000000
charge: -0.113744 -0.152552 -0.408392 0.624087 -0.334284 -0.311466 0.149566 -0.315322 -0.274919 -0.300612 -0.163277 0.024026 0.032990 -0.244905 -0.229941 0.105883 0.089296 0.084102 0.099368 0.104004 0.083957 0.089001 0.095552 0.096804 0.157288 0.135657 0.094499 0.089930 0.085502 0.092716 0.085963 0.089401 0.087168 0.082551 0.081311 0.088792
qa: -0.1137 -0.1526 -0.4084 0.6241 -0.3343 -0.3115 0.1496 -0.3153 -0.2749 -0.3006 -0.1633 0.0240 0.0330 -0.2449 -0.2299 0.1059 0.0893 0.0841 0.0994 0.1040 0.0840 0.0890 0.0956 0.0968 0.1573 0.1357 0.0945 0.0899 0.0855 0.0927 0.0860 0.0894 0.0872 0.0826 0.0813 0.0888
va: 2.2759 2.2818 2.0249 5.4236 2.1091 2.1183 3.9364 3.9273 3.8704 3.9162 4.0145 3.8951 3.8824 3.8969 3.9210 1.0131 1.0078 1.0048 1.0132 1.0142 1.0075 1.0086 1.0150 1.0225 1.0215 1.0034 0.9906 1.0133 0.9892 1.0140 1.0203 1.0042 1.0139 1.0108 1.0223 1.0064
dispcorr: -0.018338406 hartree
energy: -2042.197987160307
dipole: 11.17462 -10.91825 0.25636 2.36831 -2.47246 -0.10415 6.74818 -6.09209 0.65609
magnitude: 0.71206 au
magnitude: 1.80991 debye
