program: Orca
programVersion: 5.0.2
elementType: S S S P O O C C C C C C C C C H H H H H H H H H H H H H H H H H H H H H
charge: 0
multiplicity: 1
keywords: wb97x-d3
keywords: def2-TZVPP
keywords: def2/J RIJCOSX
keywords: DEFGRID2
keywords: scfconv7
keywords: smallprint printgap noloewdin
keywords: NOSOSCF
formula: C9H21O2PS3
InChI: InChI=1/C9H21O2PS3/c1-6-10-12(13,11-7-2)15-8-14-9(3,4)5/h6-8H2,1-5H3
36 atoms
S  2.055186 -0.108825 1.182449
S  0.515619 0.013296 -1.50784
S  -2.753088 -0.293734 -1.698962
P  -1.329409 0.495591 -0.686552
O  -1.224529 0.121467 0.869502
O  -1.284836 2.092268 -0.585156
C  3.439131 -1.221731 0.695784
C  4.694308 -0.412665 0.391861
C  3.665167 -2.081135 1.937864
C  3.061123 -2.102935 -0.48681
C  1.67612 0.796049 -0.323005
C  -1.31943 -1.247068 1.289921
C  -2.483652 2.878998 -0.6177
C  -2.688385 -1.53286 1.86198
C  -3.336717 2.710128 0.619469
H  5.526794 -1.082596 0.163489
H  4.565801 0.23818 -0.474357
H  4.980939 0.209002 1.23943
H  2.785014 -2.679266 2.175836
H  3.910639 -1.473816 2.810206
H  4.497846 -2.765613 1.765114
H  2.134513 -2.645306 -0.303786
H  2.932706 -1.530608 -1.405799
H  3.853965 -2.831983 -0.671808
H  1.283028 1.767536 -0.028885
H  2.583109 0.988987 -0.896037
H  -1.100051 -1.92177 0.457585
H  -0.534066 -1.385008 2.031499
H  -2.135889 3.906787 -0.712932
H  -3.053807 2.629508 -1.515223
H  -2.722665 -2.555511 2.239218
H  -2.917772 -0.862689 2.689923
H  -3.460471 -1.427414 1.101206
H  -3.765455 1.710328 0.676794
H  -2.765495 2.896042 1.527801
H  -4.162978 3.421107 0.586057
totalener: -2042.18045433 hartree
nucrepener: 1713.33194249 hartree
electener: -3755.51239682 hartree
oneelecener: -6221.52472969 hartree
twoeener: 2466.01233288 hartree
kineticenergy: 2037.01174936 hartree
xcener: -124.866942440482 hartree
chargesum: 0.0000000
charge: -0.119995 -0.123182 -0.388518 0.606007 -0.315565 -0.326417 0.147289 -0.298327 -0.278467 -0.302236 -0.176201 0.035675 0.006558 -0.235505 -0.218909 0.089362 0.086892 0.100491 0.100862 0.104070 0.086185 0.104534 0.081357 0.093282 0.153526 0.128260 0.082397 0.086517 0.092744 0.093862 0.082384 0.083657 0.085958 0.078529 0.088633 0.084288
qa: -0.1200 -0.1232 -0.3885 0.6060 -0.3156 -0.3264 0.1473 -0.2983 -0.2785 -0.3022 -0.1762 0.0357 0.0066 -0.2355 -0.2189 0.0894 0.0869 0.1005 0.1009 0.1041 0.0862 0.1045 0.0814 0.0933 0.1535 0.1283 0.0824 0.0865 0.0927 0.0939 0.0824 0.0837 0.0860 0.0785 0.0886 0.0843
va: 2.2546 2.3082 2.0632 5.4358 2.0723 2.1074 3.9083 3.9341 3.8809 3.9414 4.0411 3.8797 3.9135 3.9541 3.8754 1.0060 1.0085 1.0152 1.0131 1.0112 1.0075 1.0125 1.0028 1.0091 1.0188 1.0139 1.0079 1.0041 0.9916 1.0111 1.0125 1.0034 1.0224 1.0227 1.0084 1.0123
dispcorr: -0.018079642 hartree
energy: -2042.198533975116
dipole: 12.43718 -11.48130 0.95588 -5.86692 6.05625 0.18933 13.53131 -12.71974 0.81157
magnitude: 1.26815 au
magnitude: 3.22338 debye
