program: Orca
programVersion: 5.0.2
elementType: S S S P O O C C C C C C C C C H H H H H H H H H H H H H H H H H H H H H
charge: 0
multiplicity: 1
keywords: wb97x-d3
keywords: def2-TZVPP
keywords: def2/J RIJCOSX
keywords: DEFGRID2
keywords: scfconv7
keywords: smallprint printgap noloewdin
keywords: NOSOSCF
formula: C9H21O2PS3
InChI: InChI=1/C9H21O2PS3/c1-6-10-12(13,11-7-2)15-8-14-9(3,4)5/h6-8H2,1-5H3
36 atoms
S  1.71914 -1.134845 1.266529
S  0.508822 1.030384 -0.60724
S  -2.482086 0.974391 -1.93857
P  -1.52375 0.644227 -0.315767
O  -1.599059 -0.811963 0.335096
O  -1.946081 1.460972 0.995738
C  3.174465 -1.390684 0.159774
C  3.905023 -2.576848 0.786257
C  2.721539 -1.750544 -1.251416
C  4.08528 -0.171857 0.141143
C  1.222853 0.573546 1.015663
C  -1.345981 -1.961903 -0.481893
C  -2.554829 2.75436 0.905866
C  -1.45163 -3.189719 0.38689
C  -1.580205 3.841266 0.510359
H  4.757305 -2.856014 0.163188
H  4.275521 -2.339284 1.783314
H  3.25789 -3.452073 0.865263
H  2.153218 -0.945529 -1.714485
H  2.096944 -2.644156 -1.247248
H  3.590935 -1.953482 -1.882273
H  4.363809 0.139629 1.148735
H  5.003584 -0.411368 -0.399501
H  3.63116 0.676608 -0.372711
H  0.502497 0.793938 1.803037
H  2.064514 1.248408 1.164132
H  -2.071779 -1.988465 -1.298459
H  -0.346244 -1.887592 -0.918149
H  -3.390308 2.714914 0.203402
H  -2.959341 2.938164 1.900692
H  -0.702569 -3.173019 1.177077
H  -2.439013 -3.273858 0.839511
H  -1.284745 -4.078883 -0.22143
H  -2.080468 4.808603 0.566707
H  -0.717417 3.870056 1.175466
H  -1.224168 3.711793 -0.510881
totalener: -2042.18164650 hartree
nucrepener: 1724.70214016 hartree
electener: -3766.88378666 hartree
oneelecener: -6244.08346061 hartree
twoeener: 2477.19967395 hartree
kineticenergy: 2037.01290911 hartree
xcener: -124.868310907474 hartree
chargesum: 0.0000000
charge: -0.125016 -0.151709 -0.380555 0.601656 -0.304593 -0.320916 0.169146 -0.273142 -0.328291 -0.324149 -0.159197 -0.018976 0.020939 -0.225252 -0.239515 0.084914 0.102664 0.098744 0.110505 0.087141 0.097434 0.102861 0.095237 0.088422 0.146347 0.137598 0.119758 0.088350 0.093665 0.097012 0.084706 0.089972 0.073664 0.088635 0.081202 0.090742
qa: -0.1250 -0.1517 -0.3806 0.6017 -0.3046 -0.3209 0.1691 -0.2731 -0.3283 -0.3241 -0.1592 -0.0190 0.0209 -0.2253 -0.2395 0.0849 0.1027 0.0987 0.1105 0.0871 0.0974 0.1029 0.0952 0.0884 0.1463 0.1376 0.1198 0.0883 0.0937 0.0970 0.0847 0.0900 0.0737 0.0886 0.0812 0.0907
va: 2.2700 2.2784 2.0872 5.4725 2.1293 2.1105 3.8655 3.8921 3.9307 3.9316 4.0339 3.8756 3.8784 3.9368 3.8944 1.0071 1.0153 1.0115 1.0181 1.0083 1.0117 1.0092 1.0094 0.9992 1.0212 0.9985 1.0137 0.9871 1.0162 0.9917 1.0166 1.0080 1.0074 1.0143 1.0057 1.0177
dispcorr: -0.018778937 hartree
energy: -2042.200425434989
dipole: 18.34471 -17.29778 1.04693 -8.42274 8.40136 -0.02138 4.24759 -3.60021 0.64738
magnitude: 1.23110 au
magnitude: 3.12921 debye
