program: Orca
programVersion: 5.0.2
elementType: S S S P O O C C C C C C C C C H H H H H H H H H H H H H H H H H H H H H
charge: 0
multiplicity: 1
keywords: wb97x-d3
keywords: def2-TZVPP
keywords: def2/J RIJCOSX
keywords: DEFGRID2
keywords: scfconv7
keywords: smallprint printgap noloewdin
keywords: NOSOSCF
formula: C9H21O2PS3
InChI: InChI=1/C9H21O2PS3/c1-6-10-12(13,11-7-2)15-8-14-9(3,4)5/h6-8H2,1-5H3
36 atoms
S  1.724582 -1.376707 0.666751
S  0.098737 0.765297 1.908921
S  -0.481559 1.179516 -1.412376
P  -1.189298 0.558516 0.267418
O  -1.7192 -0.939905 0.334934
O  -2.471445 1.316604 0.853734
C  3.169359 -1.464428 -0.470959
C  3.283292 -2.949195 -0.809566
C  2.917319 -0.661137 -1.740343
C  4.433461 -0.990703 0.236492
C  1.677584 0.374596 1.114389
C  -1.706337 -1.827639 -0.789043
C  -2.553149 2.747251 0.816807
C  -2.924369 -1.634134 -1.661935
C  -3.456847 3.196589 -0.307427
H  4.128781 -3.109971 -1.481264
H  3.444518 -3.555293 0.082596
H  2.386731 -3.314544 -1.312333
H  2.821053 0.406657 -1.546386
H  2.005052 -0.983112 -2.239752
H  3.753154 -0.789982 -2.432434
H  4.612003 -1.555569 1.151493
H  5.300283 -1.119824 -0.416291
H  4.384531 0.068003 0.495757
H  2.442763 0.627183 1.849001
H  1.794079 1.013327 0.238617
H  -0.7855 -1.690468 -1.358941
H  -1.683797 -2.8272 -0.356671
H  -2.947567 3.050853 1.786802
H  -1.559105 3.190599 0.712299
H  -2.922425 -0.649337 -2.127839
H  -2.925327 -2.379231 -2.458548
H  -3.84532 -1.750047 -1.091497
H  -3.562837 4.281694 -0.283027
H  -3.041945 2.917889 -1.275424
H  -4.450401 2.759072 -0.213453
totalener: -2042.18042858 hartree
nucrepener: 1727.70508331 hartree
electener: -3769.88551189 hartree
oneelecener: -6250.44163610 hartree
twoeener: 2480.55612421 hartree
kineticenergy: 2037.01346611 hartree
xcener: -124.869456713649 hartree
chargesum: 0.0000000
charge: -0.125529 -0.134920 -0.415806 0.624983 -0.308883 -0.328272 0.151304 -0.276523 -0.300098 -0.303356 -0.147921 0.056646 0.024587 -0.228905 -0.228999 0.085264 0.103935 0.099603 0.089246 0.098739 0.092009 0.102108 0.089459 0.083099 0.134470 0.126203 0.065418 0.099519 0.096636 0.080494 0.079563 0.078205 0.089069 0.078714 0.084197 0.085741
qa: -0.1255 -0.1349 -0.4158 0.6250 -0.3089 -0.3283 0.1513 -0.2765 -0.3001 -0.3034 -0.1479 0.0566 0.0246 -0.2289 -0.2290 0.0853 0.1039 0.0996 0.0892 0.0987 0.0920 0.1021 0.0895 0.0831 0.1345 0.1262 0.0654 0.0995 0.0966 0.0805 0.0796 0.0782 0.0891 0.0787 0.0842 0.0857
va: 2.2309 2.3168 2.0116 5.4407 2.1276 2.1174 3.9101 3.8777 3.9554 3.9250 4.0153 3.8610 3.8943 3.9349 3.9341 1.0074 1.0127 1.0116 1.0082 1.0090 1.0095 1.0133 1.0080 1.0042 0.9990 1.0303 1.0234 0.9912 0.9928 1.0129 1.0211 1.0108 1.0064 1.0113 1.0212 1.0042
dispcorr: -0.017896935 hartree
energy: -2042.198325513394
dipole: 9.29738 -8.90561 0.39177 -5.42526 5.45676 0.03150 -12.34812 12.09681 -0.25130
magnitude: 0.46651 au
magnitude: 1.18576 debye
