program: Orca
programVersion: 5.0.2
elementType: S S S P O O C C C C C C C C C H H H H H H H H H H H H H H H H H H H H H
charge: 0
multiplicity: 1
keywords: wb97x-d3
keywords: def2-TZVPP
keywords: def2/J RIJCOSX
keywords: DEFGRID2
keywords: scfconv7
keywords: smallprint printgap noloewdin
keywords: NOSOSCF
formula: C9H21O2PS3
InChI: InChI=1/C9H21O2PS3/c1-6-10-12(13,11-7-2)15-8-14-9(3,4)5/h6-8H2,1-5H3
36 atoms
S  1.751567 -1.334037 0.920429
S  -0.014765 0.998176 1.50637
S  -0.343372 1.682926 -1.81276
P  -1.119639 0.845244 -0.27592
O  -1.457041 -0.686204 -0.527688
O  -2.516685 1.421424 0.26607
C  2.833688 -1.689748 -0.526435
C  4.158313 -0.9482 -0.400254
C  3.065411 -3.196799 -0.441094
C  2.127597 -1.343689 -1.830359
C  1.617999 0.471808 0.914963
C  -1.985369 -1.573103 0.466567
C  -2.717131 2.826903 0.461804
C  -1.708081 -2.989027 0.025764
C  -4.158987 3.160359 0.165974
H  4.660833 -1.188675 0.536625
H  4.822157 -1.225081 -1.22278
H  4.027094 0.133831 -0.446211
H  3.561554 -3.478032 0.488295
H  3.69817 -3.518118 -1.270584
H  2.127656 -3.750797 -0.508286
H  1.906924 -0.280284 -1.921457
H  2.759829 -1.617872 -2.678768
H  1.182252 -1.877024 -1.921604
H  2.338027 0.922146 1.597208
H  1.779625 0.888789 -0.080383
H  -1.51274 -1.376162 1.432317
H  -3.057878 -1.391474 0.566941
H  -2.461533 3.073054 1.49528
H  -2.049847 3.39323 -0.193247
H  -2.133808 -3.686159 0.74771
H  -2.150769 -3.199865 -0.947641
H  -0.634867 -3.169067 -0.028603
H  -4.839117 2.594125 0.801487
H  -4.33226 4.220614 0.350424
H  -4.404397 2.95428 -0.874915
totalener: -2042.18106428 hartree
nucrepener: 1723.20443158 hartree
electener: -3765.38549585 hartree
oneelecener: -6241.27217794 hartree
twoeener: 2475.88668209 hartree
kineticenergy: 2037.00478941 hartree
xcener: -124.864616370440 hartree
chargesum: -0.0000000
charge: -0.143696 -0.162055 -0.382555 0.628441 -0.289483 -0.334463 0.144781 -0.297844 -0.279817 -0.286025 -0.122605 -0.026104 0.021391 -0.200970 -0.225250 0.099624 0.089892 0.085635 0.103859 0.086861 0.101391 0.086897 0.089757 0.097573 0.143831 0.111185 0.097361 0.108026 0.088777 0.086586 0.080091 0.090337 0.061323 0.082260 0.076442 0.088546
qa: -0.1437 -0.1621 -0.3826 0.6284 -0.2895 -0.3345 0.1448 -0.2978 -0.2798 -0.2860 -0.1226 -0.0261 0.0214 -0.2010 -0.2252 0.0996 0.0899 0.0856 0.1039 0.0869 0.1014 0.0869 0.0898 0.0976 0.1438 0.1112 0.0974 0.1080 0.0888 0.0866 0.0801 0.0903 0.0613 0.0823 0.0764 0.0885
va: 2.2272 2.2911 2.0808 5.4391 2.1341 2.1110 3.9342 3.9252 3.8821 3.9263 3.9971 3.8994 3.8782 3.9140 3.9592 1.0135 1.0083 1.0053 1.0132 1.0071 1.0066 1.0279 1.0113 1.0134 0.9966 1.0444 1.0042 0.9984 0.9917 1.0146 1.0121 1.0064 1.0294 1.0055 1.0089 1.0090
dispcorr: -0.018562791 hartree
energy: -2042.199627066426
dipole: 6.47349 -6.54832 -0.07483 -12.03763 11.79663 -0.24100 -2.87783 3.48504 0.60721
magnitude: 0.65756 au
magnitude: 1.67140 debye
