program: Orca
programVersion: 5.0.2
elementType: S S S P O O C C C C C C C C C H H H H H H H H H H H H H H H H H H H H H
charge: 0
multiplicity: 1
keywords: wb97x-d3
keywords: def2-TZVPP
keywords: def2/J RIJCOSX
keywords: DEFGRID2
keywords: scfconv7
keywords: smallprint printgap noloewdin
keywords: NOSOSCF
formula: C9H21O2PS3
InChI: InChI=1/C9H21O2PS3/c1-6-10-12(13,11-7-2)15-8-14-9(3,4)5/h6-8H2,1-5H3
36 atoms
S  1.674587 -1.578466 0.884636
S  -0.186163 0.606812 1.748931
S  -0.034342 2.144333 -1.279638
P  -1.021664 0.955653 -0.147361
O  -1.300383 -0.453416 -0.828316
O  -2.488864 1.407823 0.313407
C  2.876536 -1.610869 -0.512087
C  3.145192 -3.099179 -0.725123
C  2.262743 -1.006371 -1.767509
C  4.167271 -0.897592 -0.130143
C  1.512684 0.185518 1.263918
C  -1.964898 -1.541457 -0.171298
C  -2.790982 2.749755 0.711208
C  -1.658934 -2.809553 -0.929159
C  -4.220121 3.053257 0.331057
H  2.230484 -3.642751 -0.967303
H  3.836059 -3.230943 -1.560146
H  3.591881 -3.559579 0.156736
H  1.336638 -1.511341 -2.038855
H  2.960418 -1.100301 -2.603586
H  2.031507 0.052882 -1.656432
H  4.608032 -1.326777 0.769724
H  4.895644 -0.984666 -0.940114
H  4.01078 0.167774 0.043483
H  2.138449 0.461155 2.111639
H  1.796759 0.809451 0.414405
H  -1.614108 -1.62394 0.860311
H  -3.038681 -1.341402 -0.152924
H  -2.643558 2.835145 1.790466
H  -2.104845 3.445237 0.221567
H  -2.17328 -3.647362 -0.458042
H  -1.990779 -2.750336 -1.965298
H  -0.589551 -3.017181 -0.911848
H  -4.916424 2.361866 0.804896
H  -4.477844 4.062187 0.652942
H  -4.358709 2.998122 -0.748025
totalener: -2042.18118506 hartree
nucrepener: 1723.15541069 hartree
electener: -3765.33659575 hartree
oneelecener: -6241.16312108 hartree
twoeener: 2475.82652533 hartree
kineticenergy: 2037.00139553 hartree
xcener: -124.864272849919 hartree
chargesum: -0.0000000
charge: -0.144839 -0.159981 -0.381936 0.626245 -0.290796 -0.334967 0.144966 -0.279115 -0.287654 -0.297785 -0.116851 -0.023806 0.021671 -0.204881 -0.224600 0.101149 0.086733 0.103174 0.096282 0.089871 0.087343 0.098875 0.089633 0.086763 0.144379 0.106329 0.097902 0.108193 0.089165 0.087834 0.081471 0.091780 0.060166 0.083142 0.076803 0.087343
qa: -0.1448 -0.1600 -0.3819 0.6262 -0.2908 -0.3350 0.1450 -0.2791 -0.2877 -0.2978 -0.1169 -0.0238 0.0217 -0.2049 -0.2246 0.1011 0.0867 0.1032 0.0963 0.0899 0.0873 0.0989 0.0896 0.0868 0.1444 0.1063 0.0979 0.1082 0.0892 0.0878 0.0815 0.0918 0.0602 0.0831 0.0768 0.0873
va: 2.2259 2.2896 2.0821 5.4379 2.1294 2.1159 3.9347 3.8817 3.9248 3.9264 3.9912 3.8946 3.8769 3.9201 3.9530 1.0065 1.0070 1.0135 1.0120 1.0121 1.0320 1.0135 1.0082 1.0048 0.9969 1.0493 1.0053 0.9981 0.9925 1.0154 1.0120 1.0058 1.0261 1.0053 1.0095 1.0089
dispcorr: -0.018705521 hartree
energy: -2042.199890581604
dipole: 6.00747 -6.25100 -0.24353 -11.54914 11.17524 -0.37389 -5.78823 6.20659 0.41836
magnitude: 0.61166 au
magnitude: 1.55472 debye
