program: Orca
programVersion: 5.0.2
elementType: S S S P O O C C C C C C C C C H H H H H H H H H H H H H H H H H H H H H
charge: 0
multiplicity: 1
keywords: wb97x-d3
keywords: def2-TZVPP
keywords: def2/J RIJCOSX
keywords: DEFGRID2
keywords: scfconv7
keywords: smallprint printgap noloewdin
keywords: NOSOSCF
formula: C9H21O2PS3
InChI: InChI=1/C9H21O2PS3/c1-6-10-12(13,11-7-2)15-8-14-9(3,4)5/h6-8H2,1-5H3
36 atoms
S  1.696757 -1.062888 0.945159
S  -0.044993 1.29762 1.428507
S  -0.729236 0.662283 -1.862126
P  -1.349314 0.584824 -0.04016
O  -1.75613 -0.847165 0.526982
O  -2.653969 1.454547 0.302047
C  3.059569 -1.470682 -0.22161
C  2.626598 -1.237076 -1.663316
C  4.313964 -0.671429 0.110026
C  3.309662 -2.958333 0.014308
C  1.533199 0.725358 0.747033
C  -2.234838 -1.916861 -0.296427
C  -3.002886 2.631758 -0.435308
C  -1.689871 -3.217654 0.241751
C  -2.108718 3.812647 -0.128836
H  3.42137 -1.547276 -2.346539
H  1.726707 -1.801325 -1.903589
H  2.413218 -0.188595 -1.86985
H  4.615028 -0.816475 1.14759
H  4.174054 0.397554 -0.05658
H  5.141011 -0.988413 -0.529966
H  3.618164 -3.156339 1.041552
H  2.418113 -3.552458 -0.193678
H  4.103063 -3.309017 -0.64877
H  2.296033 1.266717 1.3074
H  1.58694 1.019152 -0.301792
H  -3.327003 -1.903963 -0.273696
H  -1.917047 -1.763689 -1.33044
H  -2.98766 2.408763 -1.504649
H  -4.032885 2.842281 -0.148759
H  -2.000409 -3.386574 1.272119
H  -2.05999 -4.046289 -0.362441
H  -0.601301 -3.222717 0.206633
H  -2.075885 4.025973 0.93912
H  -1.090433 3.647313 -0.478997
H  -2.495768 4.695849 -0.63814
totalener: -2042.17990394 hartree
nucrepener: 1728.91904843 hartree
electener: -3771.09895237 hartree
oneelecener: -6252.92968462 hartree
twoeener: 2481.83073225 hartree
kineticenergy: 2037.01262345 hartree
xcener: -124.868677054802 hartree
chargesum: -0.0000000
charge: -0.123723 -0.124330 -0.419502 0.636211 -0.299889 -0.336706 0.144111 -0.289641 -0.303270 -0.275117 -0.145313 0.014689 0.022577 -0.209337 -0.243783 0.089951 0.093695 0.088655 0.102037 0.082009 0.089380 0.104358 0.099302 0.085110 0.135938 0.121593 0.097276 0.086326 0.091467 0.094167 0.086864 0.078007 0.066946 0.090650 0.083266 0.086024
qa: -0.1237 -0.1243 -0.4195 0.6362 -0.2999 -0.3367 0.1441 -0.2896 -0.3033 -0.2751 -0.1453 0.0147 0.0226 -0.2093 -0.2438 0.0900 0.0937 0.0887 0.1020 0.0820 0.0894 0.1044 0.0993 0.0851 0.1359 0.1216 0.0973 0.0863 0.0915 0.0942 0.0869 0.0780 0.0669 0.0906 0.0833 0.0860
va: 2.2368 2.3087 2.0227 5.4188 2.1389 2.1206 3.9258 3.9458 3.9216 3.8786 4.0204 3.8775 3.8976 3.9313 3.8927 1.0098 1.0166 1.0087 1.0135 1.0044 1.0084 1.0131 1.0096 1.0075 0.9976 1.0298 0.9934 1.0155 1.0131 0.9908 1.0079 1.0106 1.0244 1.0037 1.0203 1.0142
dispcorr: -0.018051267 hartree
energy: -2042.197955203349
dipole: 13.24002 -13.05165 0.18837 -9.04408 9.04449 0.00041 -6.36320 6.09952 -0.26367
magnitude: 0.32405 au
magnitude: 0.82367 debye
