program: Orca
programVersion: 5.0.2
elementType: S S S P O O C C C C C C C C C H H H H H H H H H H H H H H H H H H H H H
charge: 0
multiplicity: 1
keywords: wb97x-d3
keywords: def2-TZVPP
keywords: def2/J RIJCOSX
keywords: DEFGRID2
keywords: scfconv7
keywords: smallprint printgap noloewdin
keywords: NOSOSCF
formula: C9H21O2PS3
InChI: InChI=1/C9H21O2PS3/c1-6-10-12(13,11-7-2)15-8-14-9(3,4)5/h6-8H2,1-5H3
36 atoms
S  2.125296 0.24639 -0.997129
S  0.130676 -1.825355 0.178238
S  -1.474129 0.287891 -1.970242
P  -1.232979 -0.281818 -0.148549
O  -2.468602 -0.99651 0.579077
O  -0.861147 0.886715 0.888072
C  3.421556 0.120571 0.302185
C  4.492515 -0.884359 -0.101541
C  4.015172 1.528707 0.33625
C  2.832986 -0.226055 1.663474
C  1.371233 -1.381871 -1.086923
C  -3.731794 -0.322187 0.643589
C  -0.53362 2.224762 0.49956
C  -4.808938 -1.34432 0.912829
C  -1.761642 3.105689 0.503398
H  5.299383 -0.887664 0.635041
H  4.102972 -1.902351 -0.147829
H  4.920677 -0.640546 -1.073169
H  4.821467 1.570309 1.070771
H  3.267437 2.269969 0.621516
H  4.4290 1.818386 -0.630538
H  2.022108 0.449873 1.932606
H  2.43468 -1.238577 1.694823
H  3.6101 -0.152181 2.428558
H  0.889216 -1.427521 -2.062978
H  2.117041 -2.175902 -1.047164
H  -3.697612 0.42884 1.436997
H  -3.924267 0.194392 -0.30111
H  0.199734 2.56821 1.229802
H  -0.054562 2.229396 -0.480119
H  -4.862562 -2.079525 0.111157
H  -4.637345 -1.868166 1.85235
H  -5.775531 -0.844446 0.977764
H  -1.476447 4.136793 0.291867
H  -2.466763 2.792737 -0.266564
H  -2.264307 3.089295 1.470544
totalener: -2042.17955278 hartree
nucrepener: 1730.58169345 hartree
electener: -3772.76124623 hartree
oneelecener: -6256.17984205 hartree
twoeener: 2483.41859582 hartree
kineticenergy: 2037.01538210 hartree
xcener: -124.867669748554 hartree
chargesum: -0.0000000
charge: -0.127990 -0.132112 -0.403752 0.619681 -0.317300 -0.323575 0.150412 -0.301095 -0.279093 -0.303789 -0.166567 0.017888 0.048601 -0.231828 -0.249097 0.088376 0.085550 0.103506 0.086019 0.097533 0.105508 0.099886 0.090910 0.090845 0.160437 0.133029 0.091398 0.086341 0.082308 0.092598 0.089196 0.085717 0.073897 0.089276 0.083708 0.083576
qa: -0.1280 -0.1321 -0.4038 0.6197 -0.3173 -0.3236 0.1504 -0.3011 -0.2791 -0.3038 -0.1666 0.0179 0.0486 -0.2318 -0.2491 0.0884 0.0855 0.1035 0.0860 0.0975 0.1055 0.0999 0.0909 0.0908 0.1604 0.1330 0.0914 0.0863 0.0823 0.0926 0.0892 0.0857 0.0739 0.0893 0.0837 0.0836
va: 2.2582 2.2997 2.0253 5.4287 2.1396 2.0766 3.9176 3.9288 3.8805 3.9302 4.0047 3.8798 3.8592 3.9721 3.9498 1.0069 1.0077 1.0140 1.0076 1.0111 1.0124 1.0108 1.0154 1.0085 1.0195 1.0081 0.9904 1.0060 0.9894 1.0120 1.0072 1.0050 1.0078 1.0143 1.0171 1.0041
dispcorr: -0.018316849 hartree
energy: -2042.197869626998
dipole: 9.02383 -8.65014 0.37368 8.72775 -8.36231 0.36544 10.45702 -9.54409 0.91293
magnitude: 1.05196 au
magnitude: 2.67387 debye
