program: Orca
programVersion: 5.0.2
elementType: S S S P O O C C C C C C C C C H H H H H H H H H H H H H H H H H H H H H
charge: 0
multiplicity: 1
keywords: wb97x-d3
keywords: def2-TZVPP
keywords: def2/J RIJCOSX
keywords: DEFGRID2
keywords: scfconv7
keywords: smallprint printgap noloewdin
keywords: NOSOSCF
formula: C9H21O2PS3
InChI: InChI=1/C9H21O2PS3/c1-6-10-12(13,11-7-2)15-8-14-9(3,4)5/h6-8H2,1-5H3
36 atoms
S  1.791314 -1.555277 0.69998
S  -0.201495 0.402767 1.725644
S  -0.062641 2.155567 -1.189779
P  -1.001551 0.83233 -0.170812
O  -1.181731 -0.533455 -0.959819
O  -2.502656 1.173869 0.287097
C  3.14751 -1.387871 -0.532953
C  3.47664 -2.83095 -0.908609
C  2.666955 -0.624319 -1.76019
C  4.364794 -0.721227 0.094882
C  1.53744 0.141026 1.277436
C  -1.751245 -1.72966 -0.409661
C  -2.852164 2.45551 0.824277
C  -3.184311 -1.905906 -0.85664
C  -4.285535 2.757263 0.460936
H  2.611292 -3.342639 -1.332256
H  4.267848 -2.841796 -1.660717
H  3.823343 -3.403145 -0.047481
H  1.799401 -1.105717 -2.209831
H  3.462599 -0.583116 -2.508431
H  2.381807 0.402733 -1.532561
H  4.163293 0.311524 0.383048
H  4.699225 -1.261419 0.980646
H  5.19043 -0.698423 -0.620574
H  2.110426 0.344946 2.181249
H  1.815177 0.875955 0.519761
H  -1.12131 -2.542637 -0.769242
H  -1.672669 -1.726309 0.680197
H  -2.718522 2.428914 1.908441
H  -2.183241 3.220626 0.422479
H  -3.561079 -2.863139 -0.494282
H  -3.827831 -1.120744 -0.463175
H  -3.264999 -1.905896 -1.943204
H  -4.412549 2.815952 -0.619168
H  -4.965782 1.999816 0.849154
H  -4.575582 3.717576 0.887224
totalener: -2042.18004255 hartree
nucrepener: 1717.18092516 hartree
electener: -3759.36096771 hartree
oneelecener: -6229.26408532 hartree
twoeener: 2469.90311761 hartree
kineticenergy: 2037.00243579 hartree
xcener: -124.864382184461 hartree
chargesum: 0.0000000
charge: -0.141960 -0.162347 -0.384085 0.629191 -0.294401 -0.334300 0.147763 -0.277395 -0.285977 -0.299695 -0.122066 0.026916 0.017475 -0.231444 -0.228375 0.099281 0.085475 0.102964 0.099296 0.088283 0.085702 0.084488 0.099801 0.089914 0.141269 0.111226 0.090218 0.086743 0.088331 0.089250 0.080746 0.081083 0.086457 0.088527 0.081803 0.079843
qa: -0.1420 -0.1623 -0.3841 0.6292 -0.2944 -0.3343 0.1478 -0.2774 -0.2860 -0.2997 -0.1221 0.0269 0.0175 -0.2314 -0.2284 0.0993 0.0855 0.1030 0.0993 0.0883 0.0857 0.0845 0.0998 0.0899 0.1413 0.1112 0.0902 0.0867 0.0883 0.0893 0.0807 0.0811 0.0865 0.0885 0.0818 0.0798
va: 2.2293 2.2879 2.0790 5.4329 2.1281 2.1146 3.9346 3.8734 3.9250 3.9281 4.0020 3.8732 3.8801 3.9589 3.9537 1.0137 1.0071 1.0133 1.0150 1.0110 1.0265 1.0054 1.0134 1.0081 0.9971 1.0429 0.9969 1.0129 0.9927 1.0151 1.0087 1.0155 1.0053 1.0086 1.0047 1.0096
dispcorr: -0.018077366 hartree
energy: -2042.198119916645
dipole: 4.53494 -4.75975 -0.22481 -8.54297 8.13677 -0.40620 -4.71396 5.18410 0.47015
magnitude: 0.66074 au
magnitude: 1.67946 debye
