program: Orca
programVersion: 5.0.2
elementType: S S S P O O C C C C C C C C C H H H H H H H H H H H H H H H H H H H H H
charge: 0
multiplicity: 1
keywords: wb97x-d3
keywords: def2-TZVPP
keywords: def2/J RIJCOSX
keywords: DEFGRID2
keywords: scfconv7
keywords: smallprint printgap noloewdin
keywords: NOSOSCF
formula: C9H21O2PS3
InChI: InChI=1/C9H21O2PS3/c1-6-10-12(13,11-7-2)15-8-14-9(3,4)5/h6-8H2,1-5H3
36 atoms
S  1.973387 0.138725 0.953727
S  -0.577993 -1.32905 1.335622
S  -0.994582 -0.07349 -1.819952
P  -1.483578 0.036809 0.040211
O  -3.032387 -0.21927 0.374209
O  -1.22662 1.423826 0.780289
C  3.397286 0.054642 -0.2080
C  2.928038 0.073831 -1.656961
C  4.188204 1.324763 0.097881
C  4.250607 -1.175309 0.074947
C  1.080462 -1.393205 0.606213
C  -3.879387 -1.026874 -0.450084
C  -1.356487 2.675491 0.089331
C  -3.623165 -2.507767 -0.285859
C  -0.000434 3.220828 -0.291225
H  2.35609 -0.81511 -1.922593
H  2.296526 0.937876 -1.85865
H  3.790936 0.114046 -2.32645
H  4.532668 1.34542 1.13254
H  3.589211 2.219332 -0.079364
H  5.066218 1.378576 -0.548824
H  3.70926 -2.101477 -0.124266
H  5.135988 -1.177625 -0.565797
H  4.584065 -1.195421 1.112522
H  0.980355 -1.566509 -0.465541
H  1.558216 -2.259225 1.06544
H  -4.892605 -0.772515 -0.14003
H  -3.760445 -0.731053 -1.49502
H  -1.98695 2.56673 -0.796723
H  -1.870748 3.342083 0.782013
H  -2.638151 -2.787241 -0.658094
H  -3.698234 -2.814837 0.756786
H  -4.365252 -3.06655 -0.85688
H  0.643824 3.317375 0.581455
H  0.491592 2.568566 -1.010697
H  -0.117637 4.206483 -0.74336
totalener: -2042.17929932 hartree
nucrepener: 1736.30060115 hartree
electener: -3778.47990047 hartree
oneelecener: -6267.71456893 hartree
twoeener: 2489.23466846 hartree
kineticenergy: 2037.01471334 hartree
xcener: -124.868975485347 hartree
chargesum: -0.0000000
charge: -0.117997 -0.121318 -0.418578 0.625907 -0.335282 -0.301069 0.147310 -0.302582 -0.278276 -0.298881 -0.148607 0.022955 0.037200 -0.243071 -0.237226 0.088369 0.103355 0.091709 0.104264 0.099754 0.085095 0.081720 0.088272 0.100878 0.122739 0.135832 0.094355 0.090570 0.077836 0.093637 0.083331 0.090473 0.086169 0.088930 0.073600 0.088627
qa: -0.1180 -0.1213 -0.4186 0.6259 -0.3353 -0.3011 0.1473 -0.3026 -0.2783 -0.2989 -0.1486 0.0230 0.0372 -0.2431 -0.2372 0.0884 0.1034 0.0917 0.1043 0.0998 0.0851 0.0817 0.0883 0.1009 0.1227 0.1358 0.0944 0.0906 0.0778 0.0936 0.0833 0.0905 0.0862 0.0889 0.0736 0.0886
va: 2.2334 2.3102 2.0134 5.4226 2.1212 2.1310 3.9202 3.9577 3.8800 3.9221 4.0184 3.8954 3.8929 3.8942 3.9231 1.0078 1.0039 1.0096 1.0122 1.0108 1.0077 1.0048 1.0079 1.0141 1.0306 0.9974 0.9907 1.0145 1.0124 0.9955 1.0200 1.0037 1.0140 1.0044 1.0150 1.0155
dispcorr: -0.018714817 hartree
energy: -2042.198014134817
dipole: 15.82156 -15.69656 0.12500 2.71932 -2.77085 -0.05153 -7.83445 7.54797 -0.28648
magnitude: 0.31679 au
magnitude: 0.80520 debye
