program: Orca
programVersion: 5.0.2
elementType: S S S P O O C C C C C C C C C H H H H H H H H H H H H H H H H H H H H H
charge: 0
multiplicity: 1
keywords: wb97x-d3
keywords: def2-TZVPP
keywords: def2/J RIJCOSX
keywords: DEFGRID2
keywords: scfconv7
keywords: smallprint printgap noloewdin
keywords: NOSOSCF
formula: C9H21O2PS3
InChI: InChI=1/C9H21O2PS3/c1-6-10-12(13,11-7-2)15-8-14-9(3,4)5/h6-8H2,1-5H3
36 atoms
S  2.091493 -0.186447 -0.998113
S  0.00738 -1.625439 0.804887
S  -1.585895 -0.108913 -1.776881
P  -1.235196 -0.094651 0.11511
O  -2.489158 -0.284831 1.093132
O  -0.596537 1.22905 0.731826
C  3.420521 -0.03424 0.267043
C  4.291831 1.095893 -0.281307
C  2.859015 0.359185 1.62763
C  4.237239 -1.315093 0.365468
C  1.187931 -1.685006 -0.589876
C  -3.515019 -1.242239 0.801507
C  -0.507781 2.456949 -0.001578
C  -4.744809 -0.548162 0.264297
C  -1.822485 3.20283 -0.02158
H  5.10997 1.298504 0.41244
H  4.72492 0.839321 -1.248581
H  3.722733 2.019486 -0.398601
H  2.267927 1.271752 1.563067
H  3.679589 0.532966 2.328726
H  2.218931 -0.414612 2.047114
H  5.085422 -1.16162 1.036485
H  3.658104 -2.142317 0.777738
H  4.626368 -1.61803 -0.606498
H  0.628315 -1.936712 -1.490458
H  1.856784 -2.516283 -0.369435
H  -3.155779 -1.992497 0.091971
H  -3.727632 -1.752416 1.741532
H  0.261419 3.032383 0.512985
H  -0.1543 2.255273 -1.014438
H  -4.537984 -0.080265 -0.697508
H  -5.54692 -1.273426 0.123806
H  -5.099902 0.215642 0.955845
H  -2.576929 2.658355 -0.588648
H  -2.198914 3.374846 0.98623
H  -1.684234 4.172778 -0.500583
totalener: -2042.18014085 hartree
nucrepener: 1738.33215541 hartree
electener: -3780.51229626 hartree
oneelecener: -6271.77935971 hartree
twoeener: 2491.26706345 hartree
kineticenergy: 2037.01750082 hartree
xcener: -124.869214603927 hartree
chargesum: -0.0000000
charge: -0.118663 -0.157874 -0.409087 0.625934 -0.330007 -0.311142 0.154514 -0.277279 -0.301071 -0.316194 -0.162130 0.025447 0.037633 -0.230602 -0.227226 0.084946 0.104620 0.098460 0.093222 0.089461 0.098149 0.089657 0.084945 0.105791 0.159301 0.135854 0.081284 0.095262 0.085451 0.091576 0.084158 0.080665 0.085050 0.080391 0.088322 0.081181
qa: -0.1187 -0.1579 -0.4091 0.6259 -0.3300 -0.3111 0.1545 -0.2773 -0.3011 -0.3162 -0.1621 0.0254 0.0376 -0.2306 -0.2272 0.0849 0.1046 0.0985 0.0932 0.0895 0.0981 0.0897 0.0849 0.1058 0.1593 0.1359 0.0813 0.0953 0.0855 0.0916 0.0842 0.0807 0.0850 0.0804 0.0883 0.0812
va: 2.2721 2.2880 2.0190 5.4377 2.1116 2.1135 3.9245 3.8764 3.9203 3.9276 4.0046 3.8968 3.8737 3.9286 3.9392 1.0072 1.0144 1.0125 1.0126 1.0088 1.0239 1.0079 1.0042 1.0126 1.0216 1.0026 1.0130 0.9934 0.9886 1.0127 1.0203 1.0122 1.0040 1.0208 1.0064 1.0107
dispcorr: -0.018304880 hartree
energy: -2042.198445726950
dipole: 9.44068 -9.09655 0.34413 7.49713 -7.47200 0.02513 5.00066 -4.37661 0.62405
magnitude: 0.71309 au
magnitude: 1.81253 debye
