program: Orca
programVersion: 5.0.2
elementType: S S S P O O C C C C C C C C C H H H H H H H H H H H H H H H H H H H H H
charge: 0
multiplicity: 1
keywords: wb97x-d3
keywords: def2-TZVPP
keywords: def2/J RIJCOSX
keywords: DEFGRID2
keywords: scfconv7
keywords: smallprint printgap noloewdin
keywords: NOSOSCF
formula: C9H21O2PS3
InChI: InChI=1/C9H21O2PS3/c1-6-10-12(13,11-7-2)15-8-14-9(3,4)5/h6-8H2,1-5H3
36 atoms
S  1.698488 -1.441001 0.564508
S  -0.376227 0.417193 1.603825
S  -0.577055 1.347739 -1.662283
P  -1.539426 0.667223 -0.142347
O  -2.364064 -0.681337 -0.337183
O  -2.745068 1.543479 0.427621
C  3.186542 -1.304032 -0.511336
C  4.275959 -0.491006 0.176919
C  3.645757 -2.749441 -0.691476
C  2.819758 -0.698352 -1.860024
C  1.306226 0.283059 0.948113
C  -1.721658 -1.900793 -0.738628
C  -2.814539 2.960321 0.236391
C  -1.774492 -2.912708 0.380669
C  -1.83863 3.725875 1.101478
H  5.186828 -0.50214 -0.42662
H  3.989124 0.554069 0.302166
H  4.51662 -0.89825 1.159041
H  2.870048 -3.362081 -1.153237
H  3.918784 -3.206336 0.260165
H  4.521668 -2.779824 -1.34261
H  2.429617 0.315391 -1.769871
H  3.703399 -0.652602 -2.501611
H  2.061599 -1.293746 -2.367331
H  1.952792 0.670805 1.735047
H  1.391282 0.923174 0.068932
H  -2.262331 -2.254358 -1.616861
H  -0.687095 -1.716592 -1.038525
H  -2.656383 3.193875 -0.81862
H  -3.841619 3.220916 0.488607
H  -2.800279 -3.114722 0.687445
H  -1.331156 -3.850093 0.043718
H  -1.212095 -2.571332 1.248159
H  -0.807123 3.534059 0.808816
H  -2.022432 4.794782 0.987975
H  -1.950723 3.472632 2.154727
totalener: -2042.17983521 hartree
nucrepener: 1724.38011372 hartree
electener: -3766.55994893 hartree
oneelecener: -6243.58481819 hartree
twoeener: 2477.02486926 hartree
kineticenergy: 2037.00730939 hartree
xcener: -124.868593354358 hartree
chargesum: -0.0000000
charge: -0.147149 -0.145863 -0.404648 0.625363 -0.300121 -0.320514 0.153553 -0.305808 -0.275016 -0.289992 -0.130549 0.022687 0.024752 -0.217709 -0.239336 0.090939 0.083957 0.102915 0.099176 0.103956 0.085852 0.091018 0.091738 0.097103 0.136265 0.115127 0.099393 0.059308 0.093086 0.095446 0.093020 0.080338 0.074532 0.079204 0.087264 0.090714
qa: -0.1471 -0.1459 -0.4046 0.6254 -0.3001 -0.3205 0.1536 -0.3058 -0.2750 -0.2900 -0.1305 0.0227 0.0248 -0.2177 -0.2393 0.0909 0.0840 0.1029 0.0992 0.1040 0.0859 0.0910 0.0917 0.0971 0.1363 0.1151 0.0994 0.0593 0.0931 0.0954 0.0930 0.0803 0.0745 0.0792 0.0873 0.0907
va: 2.2464 2.2967 2.0415 5.4380 2.1480 2.1397 3.9248 3.9228 3.8760 3.9465 3.9945 3.8841 3.8890 3.9244 3.8892 1.0085 1.0046 1.0122 1.0133 1.0132 1.0070 1.0105 1.0089 1.0108 0.9995 1.0443 0.9975 1.0332 1.0122 0.9914 1.0078 1.0112 1.0217 1.0190 1.0136 1.0056
dispcorr: -0.018611896 hartree
energy: -2042.198447107186
dipole: 17.41608 -16.76375 0.65233 -5.91676 5.98363 0.06687 -2.69722 2.81168 0.11447
magnitude: 0.66566 au
magnitude: 1.69198 debye
