program: Orca
programVersion: 5.0.2
elementType: S S S P O O C C C C C C C C C H H H H H H H H H H H H H H H H H H H H H
charge: 0
multiplicity: 1
keywords: wb97x-d3
keywords: def2-TZVPP
keywords: def2/J RIJCOSX
keywords: DEFGRID2
keywords: scfconv7
keywords: smallprint printgap noloewdin
keywords: NOSOSCF
formula: C9H21O2PS3
InChI: InChI=1/C9H21O2PS3/c1-6-10-12(13,11-7-2)15-8-14-9(3,4)5/h6-8H2,1-5H3
36 atoms
S  2.643486 -1.547856 0.53823
S  -0.140558 -0.495969 0.934237
S  -0.735199 0.816341 -2.147458
P  -1.491401 0.283349 -0.468067
O  -2.68733 -0.757268 -0.634404
O  -2.173326 1.427829 0.430078
C  3.49749 -0.091831 -0.201993
C  2.770721 1.207761 0.117777
C  4.872041 -0.109317 0.463298
C  3.641155 -0.271332 -1.707948
C  0.985825 -1.461537 -0.142235
C  -3.342431 -1.42469 0.452862
C  -1.494895 2.661201 0.690573
C  -4.611668 -0.719234 0.873176
C  -2.424547 3.549301 1.480572
H  3.367849 2.052866 -0.234043
H  1.802219 1.268258 -0.378976
H  2.611978 1.324328 1.189364
H  5.405924 -1.040148 0.265963
H  4.796497 0.017566 1.543674
H  5.478584 0.709217 0.071386
H  4.146455 -1.204935 -1.952979
H  2.675898 -0.261015 -2.215689
H  4.225561 0.551569 -2.126307
H  0.980098 -1.023103 -1.140974
H  0.610398 -2.480176 -0.215146
H  -3.56644 -2.425162 0.082037
H  -2.657454 -1.538305 1.297555
H  -0.576265 2.463686 1.250736
H  -1.21295 3.126454 -0.256759
H  -5.119874 -1.318326 1.629371
H  -4.409402 0.260242 1.301054
H  -5.292551 -0.595581 0.03228
H  -3.332516 3.768986 0.92042
H  -2.705327 3.090469 2.427951
H  -1.927885 4.494088 1.700269
totalener: -2042.18156096 hartree
nucrepener: 1693.40095131 hartree
electener: -3735.58251226 hartree
oneelecener: -6181.45429790 hartree
twoeener: 2445.87178563 hartree
kineticenergy: 2037.00043285 hartree
xcener: -124.864298787119 hartree
chargesum: -0.0000000
charge: -0.123125 -0.171492 -0.379693 0.628397 -0.312099 -0.323682 0.142145 -0.277548 -0.276362 -0.297589 -0.117828 0.017391 0.028147 -0.228040 -0.239421 0.089120 0.057022 0.096980 0.102249 0.103798 0.084813 0.097679 0.098134 0.086749 0.102494 0.146030 0.095925 0.083613 0.082232 0.097558 0.081538 0.082069 0.088047 0.089420 0.082638 0.082690
qa: -0.1231 -0.1715 -0.3797 0.6284 -0.3121 -0.3237 0.1421 -0.2775 -0.2764 -0.2976 -0.1178 0.0174 0.0281 -0.2280 -0.2394 0.0891 0.0570 0.0970 0.1022 0.1038 0.0848 0.0977 0.0981 0.0867 0.1025 0.1460 0.0959 0.0836 0.0822 0.0976 0.0815 0.0821 0.0880 0.0894 0.0826 0.0827
va: 2.2587 2.2850 2.0723 5.4358 2.1575 2.1053 3.9558 3.8963 3.8692 3.9441 3.9803 3.8985 3.8721 3.9304 3.9623 1.0136 1.0470 1.0145 1.0124 1.0132 1.0069 1.0152 1.0056 1.0061 1.0709 1.0030 0.9909 1.0123 0.9917 1.0066 1.0102 1.0153 1.0062 1.0056 1.0046 1.0093
dispcorr: -0.017638067 hartree
energy: -2042.199199026583
dipole: 7.16925 -7.38927 -0.22002 8.28369 -7.99651 0.28718 5.94465 -5.06156 0.88309
magnitude: 0.95432 au
magnitude: 2.42569 debye
