program: Orca
programVersion: 5.0.2
elementType: S S S P O O C C C C C C C C C H H H H H H H H H H H H H H H H H H H H H
charge: 0
multiplicity: 1
keywords: wb97x-d3
keywords: def2-TZVPP
keywords: def2/J RIJCOSX
keywords: DEFGRID2
keywords: scfconv7
keywords: smallprint printgap noloewdin
keywords: NOSOSCF
formula: C9H21O2PS3
InChI: InChI=1/C9H21O2PS3/c1-6-10-12(13,11-7-2)15-8-14-9(3,4)5/h6-8H2,1-5H3
36 atoms
S  2.078429 0.007595 -1.088886
S  -0.047042 -1.535676 0.575425
S  -1.693959 0.258205 -1.8069
P  -1.345171 0.01539 0.068994
O  -2.611298 -0.357652 0.982633
O  -0.763996 1.266274 0.868824
C  3.318935 0.01238 0.274704
C  4.394522 0.974708 -0.227533
C  2.710011 0.548083 1.565824
C  3.917214 -1.370221 0.489699
C  1.094317 -1.472033 -0.85077
C  -3.556919 -1.353246 0.578718
C  -1.138353 2.609697 0.525188
C  -4.937502 -0.914014 1.002436
C  -0.04221 3.282249 -0.265188
H  3.979461 1.959598 -0.448996
H  5.159206 1.106439 0.540861
H  4.879558 0.601169 -1.129635
H  1.910281 -0.089518 1.936393
H  2.294109 1.544277 1.42071
H  3.479416 0.610742 2.339949
H  3.191054 -2.070884 0.904256
H  4.313321 -1.78699 -0.437287
H  4.73842 -1.306867 1.207231
H  0.500394 -1.57036 -1.759862
H  1.713199 -2.363748 -0.758167
H  -3.518611 -1.494455 -0.504629
H  -3.281678 -2.299259 1.050664
H  -2.074844 2.619115 -0.037038
H  -1.315645 3.117964 1.473203
H  -5.226321 0.008365 0.499502
H  -5.663959 -1.682794 0.73807
H  -4.994469 -0.75416 2.078842
H  -0.320581 4.317129 -0.467989
H  0.897344 3.286763 0.286417
H  0.119787 2.775492 -1.214926
totalener: -2042.18041564 hartree
nucrepener: 1732.93928247 hartree
electener: -3775.11969812 hartree
oneelecener: -6260.97807883 hartree
twoeener: 2485.85838072 hartree
kineticenergy: 2037.01643249 hartree
xcener: -124.867372121894 hartree
chargesum: -0.0000000
charge: -0.113908 -0.159315 -0.408428 0.631706 -0.330819 -0.303270 0.155748 -0.274656 -0.302961 -0.320888 -0.160982 0.019998 0.034076 -0.224353 -0.239356 0.098880 0.083470 0.102678 0.101469 0.088658 0.090116 0.083457 0.104190 0.091800 0.161841 0.135550 0.084561 0.090512 0.082203 0.094244 0.083139 0.076172 0.085028 0.089373 0.075837 0.094228
qa: -0.1139 -0.1593 -0.4084 0.6317 -0.3308 -0.3033 0.1557 -0.2747 -0.3030 -0.3209 -0.1610 0.0200 0.0341 -0.2244 -0.2394 0.0989 0.0835 0.1027 0.1015 0.0887 0.0901 0.0835 0.1042 0.0918 0.1618 0.1356 0.0846 0.0905 0.0822 0.0942 0.0831 0.0762 0.0850 0.0894 0.0758 0.0942
va: 2.2726 2.2900 2.0282 5.4320 2.1237 2.1216 3.9132 3.8873 3.9306 3.9271 4.0107 3.8803 3.8742 3.9555 3.9332 1.0108 1.0074 1.0152 1.0261 1.0129 1.0090 1.0026 1.0103 1.0093 1.0200 0.9980 1.0150 0.9944 1.0147 0.9954 1.0103 1.0093 1.0050 1.0153 1.0024 1.0140
dispcorr: -0.018355730 hartree
energy: -2042.198771372967
dipole: 11.56726 -11.36513 0.20213 5.59407 -5.71830 -0.12423 7.12395 -6.38221 0.74174
magnitude: 0.77876 au
magnitude: 1.97946 debye
