program: Orca
programVersion: 5.0.2
elementType: S S S P O O C C C C C C C C C H H H H H H H H H H H H H H H H H H H H H
charge: 0
multiplicity: 1
keywords: wb97x-d3
keywords: def2-TZVPP
keywords: def2/J RIJCOSX
keywords: DEFGRID2
keywords: scfconv7
keywords: smallprint printgap noloewdin
keywords: NOSOSCF
formula: C9H21O2PS3
InChI: InChI=1/C9H21O2PS3/c1-6-10-12(13,11-7-2)15-8-14-9(3,4)5/h6-8H2,1-5H3
36 atoms
S  2.085633 0.014586 -1.101165
S  -0.028055 -1.552943 0.551158
S  -1.731976 0.247017 -1.786022
P  -1.337912 -0.001533 0.080014
O  -2.580375 -0.380436 1.022469
O  -0.739379 1.247589 0.869588
C  3.313598 0.006392 0.274542
C  4.411527 0.946789 -0.220593
C  2.700887 0.560395 1.556322
C  3.8841 -1.385434 0.504311
C  1.099299 -1.466632 -0.884173
C  -3.539552 -1.369681 0.634217
C  -1.131942 2.590397 0.543411
C  -4.924452 -0.868076 0.964978
C  -0.065446 3.27301 -0.278181
H  4.900186 0.559872 -1.115021
H  4.016261 1.937496 -0.452161
H  5.16937 1.069902 0.556021
H  3.463528 0.613547 2.33784
H  1.886177 -0.06063 1.921981
H  2.305222 1.563356 1.401519
H  4.282398 -1.81572 -0.415595
H  4.69889 -1.331937 1.229846
H  3.140764 -2.069578 0.916025
H  0.497028 -1.545653 -1.789875
H  1.716265 -2.361739 -0.813981
H  -3.458725 -1.580218 -0.435379
H  -3.312981 -2.29067 1.175724
H  -2.085793 2.596403 0.011028
H  -1.282458 3.0937 1.498655
H  -5.022577 -0.633651 2.024693
H  -5.165227 0.024554 0.388353
H  -5.660464 -1.634745 0.721076
H  0.07061 2.770585 -1.234209
H  -0.357441 4.306489 -0.468823
H  0.890637 3.282518 0.244026
totalener: -2042.18026991 hartree
nucrepener: 1734.15813051 hartree
electener: -3776.33840042 hartree
oneelecener: -6263.40951388 hartree
twoeener: 2487.07111346 hartree
kineticenergy: 2037.01812276 hartree
xcener: -124.867599427023 hartree
chargesum: 0.0000000
charge: -0.114926 -0.158124 -0.408330 0.629440 -0.330857 -0.302702 0.156625 -0.274295 -0.303839 -0.321630 -0.158834 0.019315 0.032750 -0.222508 -0.237376 0.102255 0.098716 0.083221 0.090293 0.101820 0.088176 0.103614 0.092093 0.084100 0.161970 0.134492 0.083613 0.091648 0.082240 0.094281 0.084851 0.082754 0.076736 0.093606 0.089156 0.075656
qa: -0.1149 -0.1581 -0.4083 0.6294 -0.3309 -0.3027 0.1566 -0.2743 -0.3038 -0.3216 -0.1588 0.0193 0.0327 -0.2225 -0.2374 0.1023 0.0987 0.0832 0.0903 0.1018 0.0882 0.1036 0.0921 0.0841 0.1620 0.1345 0.0836 0.0916 0.0822 0.0943 0.0849 0.0828 0.0767 0.0936 0.0892 0.0757
va: 2.2710 2.2926 2.0276 5.4349 2.1210 2.1219 3.9093 3.8898 3.9313 3.9276 4.0096 3.8808 3.8756 3.9540 3.9331 1.0155 1.0107 1.0074 1.0091 1.0266 1.0123 1.0099 1.0095 1.0028 1.0202 0.9980 1.0162 0.9942 1.0146 0.9955 1.0050 1.0112 1.0098 1.0147 1.0152 1.0027
dispcorr: -0.018444666 hartree
energy: -2042.198714578887
dipole: 11.44698 -11.24852 0.19846 5.72513 -5.84887 -0.12374 7.06821 -6.32162 0.74660
magnitude: 0.78237 au
magnitude: 1.98863 debye
