program: Orca
programVersion: 5.0.2
elementType: S S S P O O C C C C C C C C C H H H H H H H H H H H H H H H H H H H H H
charge: 0
multiplicity: 1
keywords: wb97x-d3
keywords: def2-TZVPP
keywords: def2/J RIJCOSX
keywords: DEFGRID2
keywords: scfconv7
keywords: smallprint printgap noloewdin
keywords: NOSOSCF
formula: C9H21O2PS3
InChI: InChI=1/C9H21O2PS3/c1-6-10-12(13,11-7-2)15-8-14-9(3,4)5/h6-8H2,1-5H3
36 atoms
S  3.018032 -0.325425 0.996285
S  0.032311 -0.208798 1.338456
S  -0.89881 0.624868 -1.84016
P  -1.387513 0.542192 0.025236
O  -2.658499 -0.369286 0.382537
O  -1.773568 1.940058 0.700888
C  3.194373 -1.276001 -0.572843
C  4.415126 -2.157603 -0.318215
C  1.969832 -2.136715 -0.85307
C  3.466437 -0.331367 -1.737053
C  1.537365 0.655117 0.743262
C  -3.056946 -1.486749 -0.420312
C  -2.677904 2.848342 0.05951
C  -2.159443 -2.689858 -0.237408
C  -2.639367 4.156087 0.812768
H  4.629373 -2.750141 -1.209577
H  5.30286 -1.564403 -0.093663
H  4.247034 -2.847473 0.509348
H  2.161053 -2.766542 -1.725659
H  1.090391 -1.532991 -1.078147
H  1.733302 -2.784164 -0.009227
H  3.650411 -0.9071 -2.64725
H  2.616119 0.319669 -1.944439
H  4.339146 0.292989 -1.547733
H  1.653258 1.57453 1.313319
H  1.406168 0.917527 -0.307282
H  -4.074156 -1.710097 -0.099594
H  -3.090099 -1.188245 -1.470633
H  -2.381135 2.987065 -0.983353
H  -3.685358 2.423832 0.069453
H  -2.077476 -2.97334 0.811421
H  -2.576357 -3.536083 -0.78435
H  -1.157316 -2.507581 -0.624154
H  -3.329712 4.863118 0.353063
H  -2.934675 4.026005 1.853376
H  -1.642833 4.595891 0.790004
totalener: -2042.18263085 hartree
nucrepener: 1700.39963356 hartree
electener: -3742.58226441 hartree
oneelecener: -6195.61623741 hartree
twoeener: 2453.03397299 hartree
kineticenergy: 2037.00383732 hartree
xcener: -124.864523838759 hartree
chargesum: 0.0000000
charge: -0.120687 -0.113641 -0.419668 0.628985 -0.335586 -0.312987 0.152199 -0.278585 -0.287293 -0.299181 -0.130771 0.027210 0.007983 -0.241026 -0.227427 0.084210 0.102453 0.104066 0.090155 0.050506 0.104119 0.086110 0.097494 0.098051 0.152165 0.098418 0.094124 0.092257 0.092873 0.094533 0.093276 0.087482 0.082236 0.075331 0.087503 0.083112
qa: -0.1207 -0.1136 -0.4197 0.6290 -0.3356 -0.3130 0.1522 -0.2786 -0.2873 -0.2992 -0.1308 0.0272 0.0080 -0.2410 -0.2274 0.0842 0.1025 0.1041 0.0902 0.0505 0.1041 0.0861 0.0975 0.0981 0.1522 0.0984 0.0941 0.0923 0.0929 0.0945 0.0933 0.0875 0.0822 0.0753 0.0875 0.0831
va: 2.2593 2.3163 2.0183 5.4232 2.1102 2.1425 3.9495 3.8718 3.9059 3.9434 3.9868 3.8885 3.8904 3.9117 3.9556 1.0067 1.0130 1.0132 1.0133 1.0412 1.0104 1.0064 1.0054 1.0150 1.0023 1.0659 0.9909 1.0136 1.0051 0.9907 1.0042 1.0163 1.0005 1.0082 1.0054 1.0071
dispcorr: -0.017908319 hartree
energy: -2042.200539174199
dipole: 6.00048 -6.57779 -0.57730 -5.91184 5.85303 -0.05881 -7.96017 7.67995 -0.28021
magnitude: 0.64440 au
magnitude: 1.63795 debye
