program: Orca
programVersion: 5.0.2
elementType: S S S P O O C C C C C C C C C H H H H H H H H H H H H H H H H H H H H H
charge: 0
multiplicity: 1
keywords: wb97x-d3
keywords: def2-TZVPP
keywords: def2/J RIJCOSX
keywords: DEFGRID2
keywords: scfconv7
keywords: smallprint printgap noloewdin
keywords: NOSOSCF
formula: C9H21O2PS3
InChI: InChI=1/C9H21O2PS3/c1-6-10-12(13,11-7-2)15-8-14-9(3,4)5/h6-8H2,1-5H3
36 atoms
S  2.119206 0.05152 -1.015774
S  0.06648 -1.648183 0.584174
S  -1.681781 0.051509 -1.805982
P  -1.280474 -0.141939 0.066901
O  -2.439227 -0.646061 1.046637
O  -0.79437 1.205225 0.789681
C  3.427694 0.044835 0.28001
C  4.28879 1.25097 -0.093627
C  2.844052 0.238598 1.674514
C  4.26133 -1.227601 0.210615
C  1.222076 -1.492021 -0.818011
C  -3.728754 -0.017331 1.02742
C  -0.450178 2.40829 0.094546
C  -4.72194 -0.852472 0.25335
C  -1.642507 3.330326 -0.014433
H  5.09577 1.365049 0.632735
H  4.737638 1.136974 -1.080788
H  3.708301 2.174927 -0.088824
H  2.225059 -0.601868 1.981675
H  2.225847 1.134509 1.725219
H  3.654116 0.342288 2.401176
H  3.688733 -2.110841 0.496402
H  4.665112 -1.388007 -0.789114
H  5.100076 -1.158403 0.907182
H  0.653064 -1.614389 -1.740161
H  1.895665 -2.344128 -0.730779
H  -4.026077 0.084933 2.071346
H  -3.667624 0.990578 0.606871
H  0.348197 2.863734 0.681207
H  -0.046594 2.176252 -0.89167
H  -4.78944 -1.861574 0.658466
H  -5.711176 -0.397596 0.315771
H  -4.442674 -0.917562 -0.797091
H  -1.33691 4.276848 -0.46159
H  -2.412393 2.896953 -0.653086
H  -2.073432 3.545831 0.963475
totalener: -2042.17909408 hartree
nucrepener: 1733.82003253 hartree
electener: -3775.99912662 hartree
oneelecener: -6262.64751698 hartree
twoeener: 2486.64839037 hartree
kineticenergy: 2037.01493344 hartree
xcener: -124.868606523607 hartree
chargesum: -0.0000000
charge: -0.128243 -0.132888 -0.408835 0.627050 -0.322133 -0.319333 0.153641 -0.276829 -0.303489 -0.314683 -0.174552 0.021609 0.053182 -0.221329 -0.257244 0.085464 0.104943 0.098039 0.098574 0.094041 0.090236 0.084736 0.106546 0.090036 0.161407 0.139180 0.093488 0.072277 0.083785 0.090408 0.086545 0.076806 0.087110 0.089034 0.081539 0.089882
qa: -0.1282 -0.1329 -0.4088 0.6270 -0.3221 -0.3193 0.1536 -0.2768 -0.3035 -0.3147 -0.1746 0.0216 0.0532 -0.2213 -0.2572 0.0855 0.1049 0.0980 0.0986 0.0940 0.0902 0.0847 0.1065 0.0900 0.1614 0.1392 0.0935 0.0723 0.0838 0.0904 0.0865 0.0768 0.0871 0.0890 0.0815 0.0899
va: 2.2617 2.3046 2.0172 5.4245 2.1280 2.0864 3.9189 3.8764 3.9238 3.9266 4.0144 3.9446 3.8504 3.9205 3.9521 1.0075 1.0141 1.0121 1.0251 1.0108 1.0086 1.0047 1.0122 1.0077 1.0203 1.0017 0.9944 0.9953 0.9898 1.0133 1.0065 1.0104 1.0222 1.0142 1.0179 1.0012
dispcorr: -0.018569612 hartree
energy: -2042.197663696906
dipole: 9.96055 -9.55693 0.40361 9.47344 -9.00636 0.46708 6.02747 -5.29604 0.73143
magnitude: 0.95711 au
magnitude: 2.43278 debye
