program: Orca
programVersion: 5.0.2
elementType: S S S P O O C C C C C C C C C H H H H H H H H H H H H H H H H H H H H H
charge: 0
multiplicity: 1
keywords: wb97x-d3
keywords: def2-TZVPP
keywords: def2/J RIJCOSX
keywords: DEFGRID2
keywords: scfconv7
keywords: smallprint printgap noloewdin
keywords: NOSOSCF
formula: C9H21O2PS3
InChI: InChI=1/C9H21O2PS3/c1-6-10-12(13,11-7-2)15-8-14-9(3,4)5/h6-8H2,1-5H3
36 atoms
S  2.045587 -0.133459 -0.983109
S  0.00096 -1.626711 0.810765
S  -1.531306 -0.057399 -1.777799
P  -1.232874 -0.089767 0.123051
O  -2.513652 -0.308286 1.060188
O  -0.617898 1.22159 0.791085
C  3.429952 0.007422 0.220033
C  4.076327 1.342988 -0.146517
C  2.931272 0.049286 1.658116
C  4.430881 -1.123428 0.021805
C  1.20989 -1.667741 -0.562205
C  -3.52223 -1.266013 0.715321
C  -0.523534 2.468635 0.091339
C  -4.742121 -0.56805 0.161741
C  -1.845037 3.202114 0.056231
H  4.431694 1.351409 -1.177896
H  3.378627 2.171905 -0.020314
H  4.933917 1.526741 0.503376
H  2.165222 0.811548 1.79418
H  3.764872 0.273448 2.328725
H  2.502959 -0.901159 1.97345
H  5.280276 -0.99475 0.697105
H  3.996576 -2.09963 0.242489
H  4.809279 -1.145156 -0.999798
H  0.68145 -1.973847 -1.464027
H  1.917491 -2.455765 -0.303958
H  -3.137174 -1.994589 -0.003141
H  -3.756776 -1.802632 1.63506
H  0.226248 3.038564 0.639684
H  -0.142828 2.296145 -0.917082
H  -5.533441 -1.295539 -0.021217
H  -5.123341 0.173639 0.863131
H  -4.512062 -0.072729 -0.78059
H  -2.249078 3.344614 1.057942
H  -1.704731 4.185249 -0.394595
H  -2.578974 2.66487 -0.543829
totalener: -2042.17981478 hartree
nucrepener: 1739.80808867 hartree
electener: -3781.98790345 hartree
oneelecener: -6274.76155188 hartree
twoeener: 2492.77364843 hartree
kineticenergy: 2037.02178857 hartree
xcener: -124.869887365428 hartree
chargesum: 0.0000000
charge: -0.120296 -0.155432 -0.408898 0.627975 -0.330342 -0.313195 0.148795 -0.279904 -0.296850 -0.300688 -0.157643 0.024893 0.037439 -0.230577 -0.228217 0.104246 0.099422 0.085517 0.101853 0.089590 0.086475 0.088304 0.085649 0.101290 0.159026 0.128633 0.080933 0.095142 0.086516 0.091382 0.080548 0.084982 0.083959 0.088334 0.081014 0.080122
qa: -0.1203 -0.1554 -0.4089 0.6280 -0.3303 -0.3132 0.1488 -0.2799 -0.2968 -0.3007 -0.1576 0.0249 0.0374 -0.2306 -0.2282 0.1042 0.0994 0.0855 0.1019 0.0896 0.0865 0.0883 0.0856 0.1013 0.1590 0.1286 0.0809 0.0951 0.0865 0.0914 0.0805 0.0850 0.0840 0.0883 0.0810 0.0801
va: 2.2643 2.2870 2.0166 5.4339 2.1102 2.1092 3.9202 3.8822 3.9209 3.9332 4.0009 3.8986 3.8735 3.9288 3.9381 1.0123 1.0115 1.0072 1.0151 1.0088 1.0140 1.0064 1.0082 1.0148 1.0196 1.0099 1.0134 0.9935 0.9888 1.0126 1.0123 1.0041 1.0207 1.0064 1.0108 1.0208
dispcorr: -0.018233524 hartree
energy: -2042.198048303809
dipole: 9.61356 -9.23636 0.37720 7.45392 -7.43134 0.02259 4.59299 -3.98578 0.60721
magnitude: 0.71519 au
magnitude: 1.81786 debye
