program: Orca
programVersion: 5.0.2
elementType: S S S P O O C C C C C C C C C H H H H H H H H H H H H H H H H H H H H H
charge: 0
multiplicity: 1
keywords: wb97x-d3
keywords: def2-TZVPP
keywords: def2/J RIJCOSX
keywords: DEFGRID2
keywords: scfconv7
keywords: smallprint printgap noloewdin
keywords: NOSOSCF
formula: C9H21O2PS3
InChI: InChI=1/C9H21O2PS3/c1-6-10-12(13,11-7-2)15-8-14-9(3,4)5/h6-8H2,1-5H3
36 atoms
S  2.166229 0.330181 -1.071793
S  0.213218 -1.784085 0.105257
S  -1.722345 0.261252 -1.821888
P  -1.231808 -0.285847 -0.042618
O  -2.318773 -1.043241 0.852178
O  -0.770685 0.906134 0.927024
C  3.347444 0.124206 0.3307
C  3.982739 -1.258368 0.326219
C  4.410344 1.190052 0.067415
C  2.660297 0.400341 1.663485
C  1.321409 -1.246043 -1.236872
C  -3.593145 -0.440322 1.119133
C  -0.533075 2.247275 0.482545
C  -4.65742 -0.982404 0.193704
C  -1.783867 3.089202 0.580256
H  4.776803 -1.296758 1.075282
H  3.266654 -2.039375 0.58404
H  4.426622 -1.496355 -0.641343
H  5.130941 1.201222 0.887768
H  3.97188 2.187625 0.003999
H  4.951251 1.000189 -0.859593
H  2.236725 1.404189 1.685026
H  1.85718 -0.306012 1.861102
H  3.386434 0.327262 2.477539
H  0.735151 -1.161484 -2.153012
H  2.024678 -2.067899 -1.368743
H  -3.817636 -0.675806 2.159448
H  -3.534697 0.648852 1.041674
H  0.249201 2.632592 1.136648
H  -0.142417 2.244978 -0.535643
H  -5.625074 -0.557495 0.463215
H  -4.447321 -0.721648 -0.842014
H  -4.732827 -2.06608 0.270729
H  -2.546597 2.739853 -0.115527
H  -2.193785 3.083317 1.59039
H  -1.550544 4.122633 0.320935
totalener: -2042.17897443 hartree
nucrepener: 1741.68914293 hartree
electener: -3783.86811736 hartree
oneelecener: -6278.32130205 hartree
twoeener: 2494.45318469 hartree
kineticenergy: 2037.01809700 hartree
xcener: -124.870147231728 hartree
chargesum: -0.0000000
charge: -0.130812 -0.138756 -0.404988 0.632833 -0.320701 -0.323340 0.165984 -0.325246 -0.275689 -0.312266 -0.165461 0.017077 0.048525 -0.221716 -0.260995 0.092846 0.089196 0.102919 0.084153 0.097202 0.102126 0.083280 0.106351 0.093595 0.165406 0.133382 0.094435 0.074365 0.088218 0.094441 0.077256 0.087486 0.086736 0.083094 0.087929 0.091134
qa: -0.1308 -0.1388 -0.4050 0.6328 -0.3207 -0.3233 0.1660 -0.3252 -0.2757 -0.3123 -0.1655 0.0171 0.0485 -0.2217 -0.2610 0.0928 0.0892 0.1029 0.0842 0.0972 0.1021 0.0833 0.1064 0.0936 0.1654 0.1334 0.0944 0.0744 0.0882 0.0944 0.0773 0.0875 0.0867 0.0831 0.0879 0.0911
va: 2.2657 2.3055 2.0239 5.4195 2.1318 2.0813 3.8901 3.9312 3.8980 3.9241 4.0094 3.9514 3.8364 3.9152 3.9582 1.0099 1.0037 1.0082 1.0070 1.0108 1.0161 1.0117 1.0298 1.0099 1.0192 0.9990 0.9940 0.9907 0.9887 1.0142 1.0101 1.0235 1.0065 1.0184 1.0004 1.0143
dispcorr: -0.019055493 hartree
energy: -2042.198029922881
dipole: 8.68505 -8.35535 0.32970 9.08423 -8.73098 0.35325 9.32883 -8.42331 0.90553
magnitude: 1.02638 au
magnitude: 2.60886 debye
