program: Orca
programVersion: 5.0.2
elementType: S S S P O O C C C C C C C C C H H H H H H H H H H H H H H H H H H H H H
charge: 0
multiplicity: 1
keywords: wb97x-d3
keywords: def2-TZVPP
keywords: def2/J RIJCOSX
keywords: DEFGRID2
keywords: scfconv7
keywords: smallprint printgap noloewdin
keywords: NOSOSCF
formula: C9H21O2PS3
InChI: InChI=1/C9H21O2PS3/c1-6-10-12(13,11-7-2)15-8-14-9(3,4)5/h6-8H2,1-5H3
36 atoms
S  2.086704 0.127193 -0.990252
S  0.067589 -1.635426 0.576668
S  -1.609396 0.130749 -1.81906
P  -1.291295 -0.139571 0.06055
O  -2.486159 -0.707368 0.957626
O  -0.867593 1.18036 0.869374
C  3.467107 0.088583 0.22541
C  4.163164 1.431163 0.003617
C  2.962143 -0.003763 1.659334
C  4.429779 -1.049591 -0.088641
C  1.241597 -1.448066 -0.807409
C  -3.779796 -0.089527 0.923406
C  -0.489215 2.413391 0.249136
C  -4.745152 -0.929716 0.12055
C  -1.675006 3.342006 0.127716
H  4.527015 1.534127 -1.019463
H  3.495129 2.267652 0.213056
H  5.020967 1.515389 0.673506
H  2.22731 0.771232 1.874936
H  3.7999 0.115219 2.351362
H  2.493778 -0.963574 1.871014
H  3.968419 -2.028706 0.047357
H  4.799176 -0.98811 -1.112005
H  5.288526 -1.009411 0.585697
H  0.694302 -1.598765 -1.737829
H  1.945327 -2.27368 -0.700436
H  -4.099392 -0.000942 1.962326
H  -3.722031 0.92282 0.513025
H  0.280953 2.83906 0.893185
H  -0.03997 2.227126 -0.726903
H  -5.739557 -0.483059 0.155709
H  -4.434598 -0.989498 -0.922028
H  -4.815299 -1.940645 0.521493
H  -2.414283 2.939296 -0.56491
H  -2.151004 3.512919 1.093398
H  -1.349214 4.307454 -0.26098
totalener: -2042.17914420 hartree
nucrepener: 1730.84553702 hartree
electener: -3773.02468122 hartree
oneelecener: -6256.72640551 hartree
twoeener: 2483.70172429 hartree
kineticenergy: 2037.01270577 hartree
xcener: -124.867839375059 hartree
chargesum: -0.0000000
charge: -0.129322 -0.132571 -0.408631 0.625837 -0.321652 -0.319900 0.149033 -0.278777 -0.300585 -0.304478 -0.170001 0.021489 0.051673 -0.219174 -0.254885 0.105270 0.098672 0.086139 0.099719 0.090171 0.091357 0.085795 0.103830 0.088813 0.160744 0.134550 0.092955 0.071523 0.084954 0.090661 0.076366 0.085554 0.086693 0.080664 0.089560 0.087953
qa: -0.1293 -0.1326 -0.4086 0.6258 -0.3217 -0.3199 0.1490 -0.2788 -0.3006 -0.3045 -0.1700 0.0215 0.0517 -0.2192 -0.2549 0.1053 0.0987 0.0861 0.0997 0.0902 0.0914 0.0858 0.1038 0.0888 0.1607 0.1345 0.0930 0.0715 0.0850 0.0907 0.0764 0.0856 0.0867 0.0807 0.0896 0.0880
va: 2.2584 2.3031 2.0160 5.4253 2.1289 2.0855 3.9230 3.8768 3.9289 3.9293 4.0080 3.9450 3.8528 3.9238 3.9490 1.0128 1.0119 1.0076 1.0113 1.0083 1.0153 1.0078 1.0139 1.0067 1.0207 1.0073 0.9945 0.9962 0.9903 1.0124 1.0105 1.0218 1.0063 1.0175 1.0015 1.0144
dispcorr: -0.018352601 hartree
energy: -2042.197496803880
dipole: 10.21875 -9.79503 0.42372 9.21626 -8.77561 0.44065 5.76859 -5.03398 0.73461
magnitude: 0.95570 au
magnitude: 2.42921 debye
