program: Orca
programVersion: 5.0.2
elementType: S S S P O O C C C C C C C C C H H H H H H H H H H H H H H H H H H H H H
charge: 0
multiplicity: 1
keywords: wb97x-d3
keywords: def2-TZVPP
keywords: def2/J RIJCOSX
keywords: DEFGRID2
keywords: scfconv7
keywords: smallprint printgap noloewdin
keywords: NOSOSCF
formula: C9H21O2PS3
InChI: InChI=1/C9H21O2PS3/c1-6-10-12(13,11-7-2)15-8-14-9(3,4)5/h6-8H2,1-5H3
36 atoms
S  2.088971 0.113916 -0.986763
S  0.067584 -1.641022 0.585754
S  -1.609541 0.11826 -1.815551
P  -1.292259 -0.147699 0.064931
O  -2.487272 -0.714495 0.962363
O  -0.870781 1.17446 0.871151
C  3.481088 0.061919 0.214823
C  4.174487 1.407513 0.003893
C  2.989999 -0.049264 1.652118
C  4.441084 -1.071824 -0.123112
C  1.238446 -1.45822 -0.801713
C  -3.782701 -0.100302 0.922471
C  -0.490892 2.405787 0.248458
C  -4.744023 -0.948368 0.123563
C  -1.676165 3.334452 0.122566
H  4.526018 1.525232 -1.021892
H  3.508975 2.24061 0.233355
H  5.040428 1.482246 0.664331
H  2.522833 -1.011371 1.85567
H  2.258361 0.723543 1.88511
H  3.834637 0.059417 2.337363
H  4.800563 -0.997042 -1.149125
H  5.306326 -1.040308 0.543344
H  3.98117 -2.052799 0.004369
H  0.688752 -1.608799 -1.730769
H  1.940139 -2.285648 -0.695225
H  -4.104426 -0.006125 1.960187
H  -3.72716 0.909269 0.50558
H  0.278351 2.83272 0.89266
H  -0.040161 2.216946 -0.726359
H  -5.739506 -0.503382 0.152974
H  -4.430511 -1.015164 -0.917886
H  -4.813277 -1.956338 0.531996
H  -2.414929 2.929681 -0.569407
H  -2.153173 3.508985 1.087121
H  -1.349476 4.29837 -0.269114
totalener: -2042.17919251 hartree
nucrepener: 1729.89047666 hartree
electener: -3772.06966918 hartree
oneelecener: -6254.81863464 hartree
twoeener: 2482.74896546 hartree
kineticenergy: 2037.01335935 hartree
xcener: -124.867875244509 hartree
chargesum: 0.0000000
charge: -0.129595 -0.132440 -0.408782 0.625515 -0.321746 -0.319505 0.148460 -0.278666 -0.300015 -0.303922 -0.170051 0.021548 0.051539 -0.219008 -0.254451 0.105241 0.098742 0.086123 0.090632 0.100120 0.090100 0.103756 0.088729 0.085814 0.161078 0.134261 0.092918 0.071518 0.085540 0.090221 0.076300 0.085477 0.086682 0.080498 0.089520 0.087850
qa: -0.1296 -0.1324 -0.4088 0.6255 -0.3217 -0.3195 0.1485 -0.2787 -0.3000 -0.3039 -0.1701 0.0215 0.0515 -0.2190 -0.2545 0.1052 0.0987 0.0861 0.0906 0.1001 0.0901 0.1038 0.0887 0.0858 0.1611 0.1343 0.0929 0.0715 0.0855 0.0902 0.0763 0.0855 0.0867 0.0805 0.0895 0.0879
va: 2.2584 2.3035 2.0157 5.4254 2.1288 2.0860 3.9239 3.8767 3.9292 3.9297 4.0074 3.9448 3.8535 3.9238 3.9478 1.0127 1.0120 1.0076 1.0146 1.0115 1.0083 1.0139 1.0067 1.0080 1.0210 1.0076 0.9945 0.9964 0.9906 1.0124 1.0105 1.0218 1.0063 1.0176 1.0015 1.0144
dispcorr: -0.018297018 hartree
energy: -2042.197489528276
dipole: 10.29806 -9.87160 0.42646 9.08282 -8.64688 0.43594 5.63452 -4.90666 0.72787
magnitude: 0.94958 au
magnitude: 2.41364 debye
