program: Orca
programVersion: 5.0.2
elementType: S S S P O O C C C C C C C C C H H H H H H H H H H H H H H H H H H H H H
charge: 0
multiplicity: 1
keywords: wb97x-d3
keywords: def2-TZVPP
keywords: def2/J RIJCOSX
keywords: DEFGRID2
keywords: scfconv7
keywords: smallprint printgap noloewdin
keywords: NOSOSCF
formula: C9H21O2PS3
InChI: InChI=1/C9H21O2PS3/c1-6-10-12(13,11-7-2)15-8-14-9(3,4)5/h6-8H2,1-5H3
36 atoms
S  1.624838 -1.46974 -0.800848
S  0.88433 1.459504 -0.079386
S  -1.796315 0.157645 -1.716784
P  -1.085595 0.786442 -0.042635
O  -1.105262 -0.231696 1.18271
O  -1.809206 2.060871 0.611711
C  2.946826 -1.638128 0.469892
C  4.268641 -1.074597 -0.033403
C  2.548158 -0.992001 1.791739
C  3.061503 -3.151429 0.649098
C  1.608091 0.264305 -1.258774
C  -2.183487 -1.16371 1.359546
C  -2.191388 3.179737 -0.199609
C  -1.73667 -2.557447 0.991879
C  -3.681188 3.170888 -0.44777
H  4.23474 0.00943 -0.150195
H  5.061661 -1.287798 0.687089
H  4.553052 -1.514307 -0.9894
H  3.29162 -1.230841 2.556809
H  1.577972 -1.3513 2.132774
H  2.485213 0.091751 1.717038
H  3.813895 -3.374461 1.408013
H  2.117932 -3.587751 0.980925
H  3.358405 -3.64701 -0.275729
H  2.60859 0.641555 -1.469136
H  1.031644 0.316259 -2.182686
H  -2.46576 -1.098075 2.410874
H  -3.05144 -0.871734 0.763415
H  -1.887166 4.0705 0.351012
H  -1.645646 3.175814 -1.147076
H  -2.540364 -3.265947 1.195529
H  -1.482227 -2.617268 -0.064899
H  -0.86431 -2.858039 1.571878
H  -3.972437 2.298177 -1.030566
H  -4.237577 3.168917 0.489172
H  -3.967142 4.062578 -1.006542
totalener: -2042.18025685 hartree
nucrepener: 1734.71324704 hartree
electener: -3776.89350388 hartree
oneelecener: -6264.55893217 hartree
twoeener: 2487.66542829 hartree
kineticenergy: 2037.02174073 hartree
xcener: -124.868232188823 hartree
chargesum: 0.0000000
charge: -0.111296 -0.152255 -0.411327 0.626384 -0.302394 -0.333977 0.147291 -0.314119 -0.299504 -0.273531 -0.167256 0.033156 0.024608 -0.233169 -0.228115 0.082768 0.089649 0.105590 0.088521 0.094629 0.096716 0.083734 0.099377 0.104340 0.137675 0.159062 0.094574 0.080831 0.095793 0.080580 0.087953 0.092851 0.073414 0.084418 0.083611 0.079416
qa: -0.1113 -0.1523 -0.4113 0.6264 -0.3024 -0.3340 0.1473 -0.3141 -0.2995 -0.2735 -0.1673 0.0332 0.0246 -0.2332 -0.2281 0.0828 0.0896 0.1056 0.0885 0.0946 0.0967 0.0837 0.0994 0.1043 0.1377 0.1591 0.0946 0.0808 0.0958 0.0806 0.0880 0.0929 0.0734 0.0844 0.0836 0.0794
va: 2.2696 2.2932 2.0192 5.4393 2.1206 2.1093 3.9351 3.9240 3.9164 3.8724 4.0141 3.8749 3.8942 3.9366 3.9329 1.0048 1.0078 1.0132 1.0089 1.0180 1.0214 1.0077 1.0115 1.0144 1.0009 1.0225 0.9957 1.0155 0.9934 1.0136 1.0150 1.0129 1.0041 1.0222 1.0044 1.0116
dispcorr: -0.018452479 hartree
energy: -2042.198709324619
dipole: 8.01351 -7.64930 0.36422 -9.11926 9.31041 0.19115 8.11373 -7.48396 0.62977
magnitude: 0.75220 au
magnitude: 1.91194 debye
