program: Orca
programVersion: 5.0.2
elementType: S S S P O O C C C C C C C C C H H H H H H H H H H H H H H H H H H H H H
charge: 0
multiplicity: 1
keywords: wb97x-d3
keywords: def2-TZVPP
keywords: def2/J RIJCOSX
keywords: DEFGRID2
keywords: scfconv7
keywords: smallprint printgap noloewdin
keywords: NOSOSCF
formula: C9H21O2PS3
InChI: InChI=1/C9H21O2PS3/c1-6-10-12(13,11-7-2)15-8-14-9(3,4)5/h6-8H2,1-5H3
36 atoms
S  1.636531 -1.472135 0.553548
S  -0.315799 0.413326 1.753342
S  -0.612572 1.152172 -1.55658
P  -1.538523 0.622049 0.043732
O  -2.449197 -0.685439 0.011908
O  -2.668196 1.615941 0.581698
C  3.12571 -1.356827 -0.522141
C  4.280745 -0.713946 0.236117
C  3.456297 -2.811194 -0.849675
C  2.815539 -0.593114 -1.803119
C  1.334935 0.24538 1.029105
C  -1.945526 -2.023907 -0.037183
C  -2.682826 3.00764 0.252463
C  -1.457377 -2.425243 -1.409797
C  -1.650139 3.802865 1.019265
H  5.185516 -0.726923 -0.376379
H  4.076431 0.329105 0.482733
H  4.492701 -1.246387 1.163442
H  2.637471 -3.2974 -1.38193
H  3.66826 -3.388581 0.050946
H  4.339455 -2.853012 -1.490059
H  2.551933 0.447405 -1.614999
H  3.691313 -0.593422 -2.457014
H  1.98495 -1.045751 -2.343105
H  2.022731 0.572308 1.808917
H  1.412761 0.918987 0.175016
H  -1.15433 -2.149757 0.706455
H  -2.787893 -2.643479 0.269722
H  -2.542746 3.132073 -0.82366
H  -3.690561 3.338779 0.500974
H  -0.559681 -1.879023 -1.692078
H  -1.213461 -3.488225 -1.400476
H  -2.221231 -2.258902 -2.168459
H  -0.637198 3.533896 0.721619
H  -1.785921 4.864607 0.811176
H  -1.745822 3.652734 2.093883
totalener: -2042.17902671 hartree
nucrepener: 1733.41971305 hartree
electener: -3775.59873976 hartree
oneelecener: -6261.73442351 hartree
twoeener: 2486.13568374 hartree
kineticenergy: 2037.00748239 hartree
xcener: -124.871264903255 hartree
chargesum: 0.0000000
charge: -0.146642 -0.148840 -0.402734 0.623075 -0.298241 -0.320593 0.154981 -0.302177 -0.276744 -0.299215 -0.126979 0.001688 0.025089 -0.209537 -0.239815 0.090384 0.082798 0.102188 0.100753 0.103535 0.085886 0.088999 0.093841 0.103332 0.135661 0.114761 0.089430 0.100313 0.092300 0.095279 0.053225 0.082736 0.095634 0.077707 0.086985 0.090936
qa: -0.1466 -0.1488 -0.4027 0.6231 -0.2982 -0.3206 0.1550 -0.3022 -0.2767 -0.2992 -0.1270 0.0017 0.0251 -0.2095 -0.2398 0.0904 0.0828 0.1022 0.1008 0.1035 0.0859 0.0890 0.0938 0.1033 0.1357 0.1148 0.0894 0.1003 0.0923 0.0953 0.0532 0.0827 0.0956 0.0777 0.0870 0.0909
va: 2.2394 2.2968 2.0366 5.4398 2.1565 2.1404 3.9143 3.9238 3.8772 3.9600 3.9924 3.9030 3.8884 3.8723 3.8919 1.0080 1.0052 1.0130 1.0120 1.0127 1.0073 1.0079 1.0095 1.0019 0.9999 1.0423 1.0099 0.9929 1.0142 0.9915 1.0365 1.0111 1.0113 1.0181 1.0138 1.0056
dispcorr: -0.018854670 hartree
energy: -2042.197881382689
dipole: 18.00806 -17.33639 0.67166 -4.89209 4.95127 0.05918 -6.76977 6.88454 0.11478
magnitude: 0.68397 au
magnitude: 1.73850 debye
