program: Orca
programVersion: 5.0.2
elementType: S S S P O O C C C C C C C C C H H H H H H H H H H H H H H H H H H H H H
charge: 0
multiplicity: 1
keywords: wb97x-d3
keywords: def2-TZVPP
keywords: def2/J RIJCOSX
keywords: DEFGRID2
keywords: scfconv7
keywords: smallprint printgap noloewdin
keywords: NOSOSCF
formula: C9H21O2PS3
InChI: InChI=1/C9H21O2PS3/c1-6-10-12(13,11-7-2)15-8-14-9(3,4)5/h6-8H2,1-5H3
36 atoms
S  1.981943 0.400915 -0.925275
S  -0.070152 -1.597334 0.275407
S  -1.841976 0.613877 -1.62111
P  -1.440371 -0.033662 0.146769
O  -2.67872 -0.646702 0.965193
O  -0.860532 1.021017 1.195387
C  3.405479 -0.003801 0.167006
C  2.949838 -0.520729 1.525079
C  4.338113 -1.000011 -0.510938
C  4.114909 1.339462 0.333802
C  1.069711 -1.135266 -1.079367
C  -3.792332 -1.271185 0.317692
C  -1.263799 2.398904 1.170692
C  -3.470204 -2.645301 -0.225682
C  -0.183885 3.256422 0.55513
H  3.81026 -0.5934 2.195362
H  2.213586 0.141607 1.978752
H  2.502932 -1.51202 1.461657
H  4.691439 -0.624527 -1.470666
H  3.857712 -1.964249 -0.682001
H  5.20864 -1.189027 0.121792
H  4.433039 1.752063 -0.624875
H  3.472341 2.072606 0.82359
H  5.005228 1.209173 0.952259
H  0.482145 -1.046801 -1.992928
H  1.734593 -1.991856 -1.193889
H  -4.562089 -1.33114 1.086719
H  -4.159993 -0.621732 -0.480297
H  -2.202936 2.519506 0.624766
H  -1.446696 2.673266 2.210222
H  -3.060545 -3.297121 0.545169
H  -4.384054 -3.10343 -0.605157
H  -2.757468 -2.5952 -1.047945
H  -0.471285 4.306693 0.617026
H  0.764756 3.1319 1.076565
H  -0.033538 3.001504 -0.492427
totalener: -2042.17961693 hartree
nucrepener: 1736.83981236 hartree
electener: -3779.01942929 hartree
oneelecener: -6268.86140868 hartree
twoeener: 2489.84197939 hartree
kineticenergy: 2037.01447243 hartree
xcener: -124.867912901495 hartree
chargesum: -0.0000000
charge: -0.113935 -0.144481 -0.413653 0.624827 -0.334945 -0.306135 0.144891 -0.294400 -0.302100 -0.276637 -0.161181 0.020717 0.035805 -0.242136 -0.236583 0.089390 0.102870 0.083538 0.100833 0.085028 0.088635 0.103575 0.100972 0.085010 0.158044 0.130805 0.093428 0.091203 0.079940 0.092906 0.089136 0.086687 0.083469 0.086941 0.075197 0.092338
qa: -0.1139 -0.1445 -0.4137 0.6248 -0.3349 -0.3061 0.1449 -0.2944 -0.3021 -0.2766 -0.1612 0.0207 0.0358 -0.2421 -0.2366 0.0894 0.1029 0.0835 0.1008 0.0850 0.0886 0.1036 0.1010 0.0850 0.1580 0.1308 0.0934 0.0912 0.0799 0.0929 0.0891 0.0867 0.0835 0.0869 0.0752 0.0923
va: 2.2681 2.2840 2.0187 5.4235 2.1195 2.1201 3.9357 3.9174 3.9346 3.8783 4.0093 3.9027 3.8762 3.8891 3.9346 1.0088 1.0197 1.0108 1.0149 1.0085 1.0063 1.0125 1.0105 1.0076 1.0234 1.0076 0.9908 1.0141 1.0153 0.9953 1.0043 1.0140 1.0207 1.0150 1.0045 1.0121
dispcorr: -0.018360647 hartree
energy: -2042.197977573453
dipole: 15.24698 -14.92914 0.31784 1.43671 -1.70106 -0.26435 4.85122 -4.26006 0.59115
magnitude: 0.72136 au
magnitude: 1.83356 debye
