program: Orca
programVersion: 5.0.2
elementType: S S S P O O C C C C C C C C C H H H H H H H H H H H H H H H H H H H H H
charge: 0
multiplicity: 1
keywords: wb97x-d3
keywords: def2-TZVPP
keywords: def2/J RIJCOSX
keywords: DEFGRID2
keywords: scfconv7
keywords: smallprint printgap noloewdin
keywords: NOSOSCF
formula: C9H21O2PS3
InChI: InChI=1/C9H21O2PS3/c1-6-10-12(13,11-7-2)15-8-14-9(3,4)5/h6-8H2,1-5H3
36 atoms
S  2.02778 0.08913 -0.971998
S  -0.133413 -1.399375 0.687132
S  -1.572639 0.236886 -1.925133
P  -1.434672 0.075348 -0.01382
O  -2.776629 -0.327148 0.769478
O  -1.005819 1.373402 0.805094
C  3.379966 0.081925 0.274478
C  4.145062 1.368352 -0.035269
C  2.840004 0.129702 1.69812
C  4.294843 -1.120043 0.076622
C  1.09677 -1.413704 -0.664488
C  -3.561989 -1.446278 0.348953
C  -1.133992 2.711248 0.306831
C  -4.949586 -1.301738 0.926639
C  0.221226 3.377354 0.293179
H  4.989019 1.468449 0.649861
H  4.538676 1.369688 -1.052662
H  3.512584 2.249008 0.086029
H  2.325596 -0.789442 1.975691
H  2.134709 0.950044 1.829352
H  3.666341 0.269302 2.400075
H  5.133846 -1.070887 0.775018
H  3.78256 -2.064414 0.266033
H  4.697595 -1.150889 -0.935477
H  0.570988 -1.633562 -1.592843
H  1.751513 -2.257217 -0.444653
H  -3.600763 -1.483571 -0.743224
H  -3.086824 -2.367554 0.697575
H  -1.56598 2.703397 -0.696118
H  -1.827099 3.23165 0.970059
H  -5.438172 -0.401011 0.556666
H  -5.556956 -2.158424 0.634578
H  -4.927913 -1.260885 2.015136
H  0.67155 3.384592 1.285932
H  0.895068 2.86288 -0.390689
H  0.118323 4.411798 -0.036385
totalener: -2042.18076570 hartree
nucrepener: 1723.40528434 hartree
electener: -3765.58605003 hartree
oneelecener: -6241.89570579 hartree
twoeener: 2476.30965576 hartree
kineticenergy: 2037.00967300 hartree
xcener: -124.866874330900 hartree
chargesum: -0.0000000
charge: -0.115190 -0.162325 -0.407909 0.634800 -0.326192 -0.305714 0.144789 -0.279259 -0.293644 -0.302789 -0.160840 0.019261 0.044604 -0.230145 -0.249523 0.086271 0.105440 0.100263 0.088283 0.099518 0.089170 0.088288 0.085241 0.102454 0.158359 0.131837 0.088321 0.086050 0.082994 0.094230 0.084876 0.075021 0.085320 0.083152 0.085479 0.089511
qa: -0.1152 -0.1623 -0.4079 0.6348 -0.3262 -0.3057 0.1448 -0.2793 -0.2936 -0.3028 -0.1608 0.0193 0.0446 -0.2301 -0.2495 0.0863 0.1054 0.1003 0.0883 0.0995 0.0892 0.0883 0.0852 0.1025 0.1584 0.1318 0.0883 0.0860 0.0830 0.0942 0.0849 0.0750 0.0853 0.0832 0.0855 0.0895
va: 2.2702 2.2804 2.0349 5.4322 2.1342 2.1303 3.9321 3.8782 3.9190 3.9290 4.0122 3.8881 3.8519 3.9599 3.9233 1.0073 1.0127 1.0088 1.0132 1.0152 1.0084 1.0066 1.0078 1.0147 1.0220 1.0071 1.0075 0.9967 1.0232 0.9943 1.0083 1.0080 1.0052 1.0021 1.0197 1.0159
dispcorr: -0.017801383 hartree
energy: -2042.198567078729
dipole: 13.58107 -13.21047 0.37060 4.57799 -4.72311 -0.14512 7.77691 -7.06182 0.71509
magnitude: 0.81838 au
magnitude: 2.08017 debye
