program: Orca
programVersion: 5.0.2
elementType: S S S P O O C C C C C C C C C H H H H H H H H H H H H H H H H H H H H H
charge: 0
multiplicity: 1
keywords: wb97x-d3
keywords: def2-TZVPP
keywords: def2/J RIJCOSX
keywords: DEFGRID2
keywords: scfconv7
keywords: smallprint printgap noloewdin
keywords: NOSOSCF
formula: C9H21O2PS3
InChI: InChI=1/C9H21O2PS3/c1-6-10-12(13,11-7-2)15-8-14-9(3,4)5/h6-8H2,1-5H3
36 atoms
S  1.597066 -1.299417 -0.834127
S  0.742319 1.566227 0.022199
S  -1.848536 0.077111 -1.621233
P  -1.164996 0.739133 0.052217
O  -1.06296 -0.306518 1.254825
O  -1.995028 1.933383 0.734741
C  2.972384 -1.511214 0.368962
C  4.305663 -1.133992 -0.264304
C  2.736653 -0.725027 1.65229
C  2.94229 -3.009528 0.669443
C  1.545487 0.456988 -1.193706
C  -2.058014 -1.32703 1.431905
C  -2.825519 2.817856 -0.025854
C  -1.520496 -2.67188 1.005363
C  -2.035166 3.801974 -0.859074
H  5.121915 -1.328743 0.435579
H  4.492343 -1.707021 -1.172325
H  4.353225 -0.073648 -0.51706
H  2.809144 0.3504 1.497171
H  3.490877 -1.001292 2.393775
H  1.751249 -0.9289 2.0698
H  3.742653 -3.260048 1.368705
H  1.996053 -3.304414 1.126603
H  3.085576 -3.608432 -0.23166
H  2.542689 0.872744 -1.339332
H  1.004804 0.548711 -2.135303
H  -2.311874 -1.317417 2.492471
H  -2.965315 -1.087359 0.871485
H  -3.494747 2.232934 -0.661424
H  -3.432007 3.335855 0.716615
H  -2.266452 -3.443052 1.201488
H  -1.288669 -2.677509 -0.058056
H  -0.61534 -2.929017 1.555313
H  -1.479467 3.299259 -1.650044
H  -2.721635 4.505271 -1.331896
H  -1.332936 4.371203 -0.250875
totalener: -2042.17894050 hartree
nucrepener: 1745.91148354 hartree
electener: -3788.09042404 hartree
oneelecener: -6287.02693543 hartree
twoeener: 2498.93651139 hartree
kineticenergy: 2037.01815656 hartree
xcener: -124.868743078904 hartree
chargesum: 0.0000000
charge: -0.112082 -0.143284 -0.412094 0.627002 -0.306867 -0.337913 0.145927 -0.301899 -0.298131 -0.277774 -0.162051 0.034039 0.022611 -0.240646 -0.241540 0.088355 0.101348 0.083971 0.087719 0.089004 0.100840 0.085264 0.101135 0.103713 0.132287 0.156553 0.094407 0.080052 0.089725 0.094124 0.088697 0.095189 0.073256 0.084063 0.086318 0.088685
qa: -0.1121 -0.1433 -0.4121 0.6270 -0.3069 -0.3379 0.1459 -0.3019 -0.2981 -0.2778 -0.1621 0.0340 0.0226 -0.2406 -0.2415 0.0884 0.1013 0.0840 0.0877 0.0890 0.1008 0.0853 0.1011 0.1037 0.1323 0.1566 0.0944 0.0801 0.0897 0.0941 0.0887 0.0952 0.0733 0.0841 0.0863 0.0887
va: 2.2677 2.2845 2.0174 5.4213 2.1155 2.1128 3.9323 3.9323 3.9140 3.8786 4.0108 3.8754 3.9015 3.9370 3.8897 1.0066 1.0149 1.0081 1.0140 1.0092 1.0210 1.0077 1.0102 1.0128 1.0065 1.0205 0.9954 1.0159 1.0136 0.9911 1.0156 1.0114 1.0030 1.0222 1.0140 1.0049
dispcorr: -0.018814602 hartree
energy: -2042.197755101751
dipole: 11.64288 -11.31577 0.32711 -8.20521 8.34447 0.13926 6.34372 -5.74082 0.60290
magnitude: 0.69992 au
magnitude: 1.77905 debye
