program: Orca
programVersion: 5.0.2
elementType: S S S P O O C C C C C C C C C H H H H H H H H H H H H H H H H H H H H H
charge: 0
multiplicity: 1
keywords: wb97x-d3
keywords: def2-TZVPP
keywords: def2/J RIJCOSX
keywords: DEFGRID2
keywords: scfconv7
keywords: smallprint printgap noloewdin
keywords: NOSOSCF
formula: C9H21O2PS3
InChI: InChI=1/C9H21O2PS3/c1-6-10-12(13,11-7-2)15-8-14-9(3,4)5/h6-8H2,1-5H3
36 atoms
S  1.963598 0.109861 -1.044428
S  -0.1081 -1.622296 0.49948
S  -1.777625 0.371752 -1.710208
P  -1.3845 -0.019143 0.133196
O  -2.642162 -0.411245 1.052091
O  -0.715543 1.144614 0.996855
C  3.351439 -0.039572 0.155047
C  4.291525 -1.169415 -0.246786
C  4.066447 1.304965 0.026852
C  2.85602 -0.22435 1.583917
C  1.048301 -1.426384 -0.906599
C  -3.811228 -1.045649 0.522952
C  -1.106657 2.514588 0.822729
C  -3.591866 -2.50131 0.175481
C  -0.025792 3.279294 0.097432
H  4.668057 -1.032659 -1.260115
H  5.146767 -1.205742 0.432398
H  3.806602 -2.145529 -0.195183
H  3.4149 2.131333 0.314598
H  4.414115 1.484522 -0.991562
H  4.937676 1.322155 0.684475
H  2.392953 -1.19784 1.737773
H  3.699607 -0.149331 2.275239
H  2.120715 0.532973 1.852567
H  0.469849 -1.509054 -1.826354
H  1.70916 -2.291696 -0.849874
H  -4.560443 -0.944898 1.307872
H  -4.160237 -0.492695 -0.352256
H  -2.051677 2.583844 0.278028
H  -1.272244 2.910315 1.825524
H  -3.20004 -3.062574 1.023078
H  -4.543447 -2.947922 -0.114712
H  -2.903442 -2.615075 -0.661095
H  -0.305071 4.330936 0.026585
H  0.924775 3.215778 0.626526
H  0.115465 2.89002 -0.909017
totalener: -2042.17923632 hartree
nucrepener: 1743.87907348 hartree
electener: -3786.05830980 hartree
oneelecener: -6282.95772093 hartree
twoeener: 2496.89941113 hartree
kineticenergy: 2037.01654695 hartree
xcener: -124.868244056801 hartree
chargesum: -0.0000000
charge: -0.111528 -0.145514 -0.411381 0.626190 -0.336740 -0.305407 0.144727 -0.302733 -0.277025 -0.296903 -0.160268 0.020257 0.032587 -0.242736 -0.237540 0.101876 0.088288 0.084394 0.100524 0.104144 0.085080 0.087411 0.089260 0.100395 0.156898 0.130428 0.093494 0.091601 0.080279 0.094391 0.089078 0.087016 0.084008 0.088395 0.072794 0.094260
qa: -0.1115 -0.1455 -0.4114 0.6262 -0.3367 -0.3054 0.1447 -0.3027 -0.2770 -0.2969 -0.1603 0.0203 0.0326 -0.2427 -0.2375 0.1019 0.0883 0.0844 0.1005 0.1041 0.0851 0.0874 0.0893 0.1004 0.1569 0.1304 0.0935 0.0916 0.0803 0.0944 0.0891 0.0870 0.0840 0.0884 0.0728 0.0943
va: 2.2678 2.2814 2.0208 5.4241 2.1160 2.1171 3.9355 3.9325 3.8781 3.9143 4.0123 3.9023 3.8782 3.8896 3.9368 1.0146 1.0068 1.0078 1.0105 1.0127 1.0078 1.0136 1.0092 1.0211 1.0206 1.0075 0.9907 1.0139 1.0155 0.9954 1.0044 1.0138 1.0209 1.0153 1.0036 1.0117
dispcorr: -0.018721911 hartree
energy: -2042.197958233209
dipole: 14.71224 -14.44586 0.26638 2.75050 -2.88388 -0.13337 5.09460 -4.42275 0.67185
magnitude: 0.73494 au
magnitude: 1.86806 debye
