program: Orca
programVersion: 5.0.2
elementType: S S S P O O C C C C C C C C C H H H H H H H H H H H H H H H H H H H H H
charge: 0
multiplicity: 1
keywords: wb97x-d3
keywords: def2-TZVPP
keywords: def2/J RIJCOSX
keywords: DEFGRID2
keywords: scfconv7
keywords: smallprint printgap noloewdin
keywords: NOSOSCF
formula: C9H21O2PS3
InChI: InChI=1/C9H21O2PS3/c1-6-10-12(13,11-7-2)15-8-14-9(3,4)5/h6-8H2,1-5H3
36 atoms
S  2.907743 -0.301389 1.172049
S  -0.092415 -0.347101 1.37287
S  -0.936773 0.810609 -1.731705
P  -1.494962 0.483838 0.088576
O  -2.733354 -0.519505 0.265764
O  -1.989547 1.766969 0.902662
C  3.185102 -1.124676 -0.45336
C  2.007212 -2.00507 -0.8487
C  3.463924 -0.086306 -1.533309
C  4.427858 -1.978542 -0.211488
C  1.395157 0.631987 0.929245
C  -3.007043 -1.585043 -0.652628
C  -2.87168 2.722733 0.291107
C  -2.060816 -2.754629 -0.498297
C  -2.114647 3.978287 -0.069691
H  1.11974 -1.415968 -1.080476
H  2.262309 -2.572048 -1.747717
H  1.751911 -2.712063 -0.060265
H  4.301562 0.556072 -1.262802
H  2.595279 0.544378 -1.727743
H  3.707323 -0.585278 -2.474588
H  4.253159 -2.734247 0.555059
H  4.700796 -2.494757 -1.133825
H  5.282032 -1.372641 0.094472
H  1.441201 1.502141 1.58089
H  1.298857 0.980017 -0.100078
H  -4.030852 -1.885009 -0.431271
H  -2.979252 -1.201109 -1.674933
H  -3.353157 2.29995 -0.594306
H  -3.65112 2.924208 1.026252
H  -2.038659 -3.120796 0.527539
H  -2.392184 -3.570899 -1.141096
H  -1.044558 -2.494722 -0.791854
H  -1.618805 4.403433 0.802441
H  -1.366232 3.772838 -0.833662
H  -2.804706 4.726173 -0.461653
totalener: -2042.18180145 hartree
nucrepener: 1709.88619339 hartree
electener: -3752.06799485 hartree
oneelecener: -6214.57069395 hartree
twoeener: 2462.50269910 hartree
kineticenergy: 2037.00554300 hartree
xcener: -124.865758367392 hartree
chargesum: -0.0000000
charge: -0.119805 -0.113308 -0.422209 0.626077 -0.331285 -0.319715 0.150518 -0.293815 -0.298063 -0.277118 -0.128265 0.027359 0.027866 -0.243522 -0.228516 0.052041 0.091509 0.105762 0.098373 0.096962 0.086575 0.104141 0.084383 0.102704 0.152691 0.097665 0.094456 0.091861 0.077143 0.094819 0.093464 0.088391 0.081475 0.084742 0.085252 0.079392
qa: -0.1198 -0.1133 -0.4222 0.6261 -0.3313 -0.3197 0.1505 -0.2938 -0.2981 -0.2771 -0.1283 0.0274 0.0279 -0.2435 -0.2285 0.0520 0.0915 0.1058 0.0984 0.0970 0.0866 0.1041 0.0844 0.1027 0.1527 0.0977 0.0945 0.0919 0.0771 0.0948 0.0935 0.0884 0.0815 0.0847 0.0853 0.0794
va: 2.2610 2.3170 2.0070 5.4228 2.1183 2.1250 3.9511 3.9088 3.9433 3.8707 3.9835 3.8887 3.9063 3.9124 3.9238 1.0374 1.0131 1.0095 1.0149 1.0056 1.0064 1.0132 1.0069 1.0127 1.0018 1.0665 0.9910 1.0136 1.0101 0.9951 1.0041 1.0163 0.9990 1.0048 1.0205 1.0120
dispcorr: -0.018381763 hartree
energy: -2042.200183217640
dipole: 8.25130 -8.73509 -0.48379 -5.19296 5.09359 -0.09937 -10.33235 9.95605 -0.37629
magnitude: 0.62091 au
magnitude: 1.57822 debye
