program: Orca
programVersion: 5.0.2
elementType: S S S P O O C C C C C C C C C H H H H H H H H H H H H H H H H H H H H H
charge: 0
multiplicity: 1
keywords: wb97x-d3
keywords: def2-TZVPP
keywords: def2/J RIJCOSX
keywords: DEFGRID2
keywords: scfconv7
keywords: smallprint printgap noloewdin
keywords: NOSOSCF
formula: C9H21O2PS3
InChI: InChI=1/C9H21O2PS3/c1-6-10-12(13,11-7-2)15-8-14-9(3,4)5/h6-8H2,1-5H3
36 atoms
S  2.987259 -0.110682 1.000942
S  0.018508 -0.105181 1.4228
S  -1.050897 0.523099 -1.760911
P  -1.484292 0.485912 0.121132
O  -2.668121 -0.508907 0.544729
O  -1.97517 1.874052 0.743607
C  3.153026 -1.174062 -0.495377
C  3.390082 -0.314041 -1.730142
C  4.390834 -2.015861 -0.1929
C  1.940302 -2.073474 -0.693276
C  1.460263 0.789504 0.726689
C  -3.005631 -1.684389 -0.200219
C  -2.901241 2.710457 0.03141
C  -2.053963 -2.830108 0.057645
C  -2.195261 3.935884 -0.496837
H  3.567998 -0.952032 -2.59913
H  2.525093 0.306911 -1.967102
H  4.254884 0.33634 -1.602319
H  4.604447 -2.670653 -1.039719
H  4.242659 -2.643475 0.686439
H  5.271699 -1.394648 -0.023828
H  2.135424 -2.767919 -1.514374
H  1.722141 -2.655606 0.2016
H  1.048643 -1.504654 -0.95761
H  1.550481 1.747944 1.233813
H  1.28778 0.977285 -0.333942
H  -4.0148 -1.938619 0.123376
H  -3.041373 -1.444886 -1.265534
H  -3.37456 2.162577 -0.787376
H  -3.680372 2.976265 0.7464
H  -1.057093 -2.620303 -0.328584
H  -1.971634 -3.049989 1.121592
H  -2.422729 -3.724945 -0.444768
H  -2.914831 4.59623 -0.981866
H  -1.716371 4.493975 0.307296
H  -1.439622 3.660322 -1.231441
totalener: -2042.18164998 hartree
nucrepener: 1709.50504175 hartree
electener: -3751.68669173 hartree
oneelecener: -6213.81158273 hartree
twoeener: 2462.12489100 hartree
kineticenergy: 2037.00959378 hartree
xcener: -124.866446008111 hartree
chargesum: -0.0000000
charge: -0.120757 -0.111455 -0.422891 0.625467 -0.331135 -0.319349 0.153102 -0.296573 -0.278605 -0.296146 -0.126609 0.028451 0.027701 -0.239887 -0.226453 0.086477 0.096099 0.097817 0.084362 0.104418 0.102767 0.091297 0.104240 0.054722 0.151964 0.096435 0.093997 0.091374 0.076232 0.094801 0.079113 0.093051 0.087643 0.079444 0.085533 0.083352
qa: -0.1208 -0.1115 -0.4229 0.6255 -0.3311 -0.3193 0.1531 -0.2966 -0.2786 -0.2961 -0.1266 0.0285 0.0277 -0.2399 -0.2265 0.0865 0.0961 0.0978 0.0844 0.1044 0.1028 0.0913 0.1042 0.0547 0.1520 0.0964 0.0940 0.0914 0.0762 0.0948 0.0791 0.0931 0.0876 0.0794 0.0855 0.0834
va: 2.2596 2.3205 2.0054 5.4234 2.1173 2.1254 3.9486 3.9441 3.8716 3.9090 3.9838 3.8891 3.9033 3.9136 3.9267 1.0063 1.0055 1.0151 1.0068 1.0134 1.0125 1.0134 1.0088 1.0394 1.0021 1.0665 0.9910 1.0142 1.0116 0.9953 1.0004 1.0044 1.0163 1.0118 1.0047 1.0197
dispcorr: -0.018356822 hartree
energy: -2042.200006798812
dipole: 7.42233 -7.93923 -0.51690 -6.71935 6.57662 -0.14274 -10.03657 9.69492 -0.34165
magnitude: 0.63584 au
magnitude: 1.61617 debye
