program: Orca
programVersion: 5.0.2
elementType: S S S P O O C C C C C C C C C H H H H H H H H H H H H H H H H H H H H H
charge: 0
multiplicity: 1
keywords: wb97x-d3
keywords: def2-TZVPP
keywords: def2/J RIJCOSX
keywords: DEFGRID2
keywords: scfconv7
keywords: smallprint printgap noloewdin
keywords: NOSOSCF
formula: C9H21O2PS3
InChI: InChI=1/C9H21O2PS3/c1-6-10-12(13,11-7-2)15-8-14-9(3,4)5/h6-8H2,1-5H3
36 atoms
S  2.914688 -0.301007 1.149424
S  -0.080269 -0.31624 1.370006
S  -0.94917 0.823202 -1.734491
P  -1.496513 0.496555 0.088983
O  -2.725462 -0.51757 0.273963
O  -2.002687 1.774916 0.903303
C  3.181625 -1.15953 -0.459466
C  1.983361 -2.014383 -0.849511
C  3.495797 -0.146509 -1.553445
C  4.398689 -2.042674 -0.193989
C  1.409891 0.640366 0.889268
C  -2.993012 -1.588728 -0.639506
C  -2.93712 2.689177 0.306535
C  -2.030799 -2.746109 -0.490827
C  -2.240208 3.968828 -0.088463
H  2.230788 -2.603359 -1.736563
H  1.702558 -2.701078 -0.051555
H  1.113758 -1.405749 -1.09924
H  2.645568 0.50358 -1.764659
H  3.734301 -0.666075 -2.484755
H  4.34718 0.4786 -1.286114
H  5.267723 -1.455379 0.106476
H  4.197789 -2.77857 0.585236
H  4.662964 -2.583343 -1.104776
H  1.467182 1.527492 1.516535
H  1.30899 0.960833 -0.148543
H  -4.011039 -1.901358 -0.408668
H  -2.978905 -1.206692 -1.662926
H  -3.426286 2.238438 -0.560984
H  -3.704291 2.86881 1.06016
H  -1.990744 -3.105297 0.536977
H  -2.36057 -3.57029 -1.124151
H  -1.021942 -2.475229 -0.799352
H  -2.967495 4.677904 -0.484511
H  -1.751015 4.432311 0.767533
H  -1.494603 3.781143 -0.859583
totalener: -2042.18174069 hartree
nucrepener: 1708.97287895 hartree
electener: -3751.15461964 hartree
oneelecener: -6212.74179603 hartree
twoeener: 2461.58717639 hartree
kineticenergy: 2037.00701391 hartree
xcener: -124.865895751587 hartree
chargesum: -0.0000000
charge: -0.120366 -0.113248 -0.421356 0.626295 -0.332049 -0.319796 0.151861 -0.298026 -0.297038 -0.277445 -0.127653 0.027603 0.027580 -0.243566 -0.226792 0.092195 0.106369 0.053323 0.096765 0.086459 0.098202 0.102733 0.104254 0.084264 0.152880 0.097897 0.094505 0.091791 0.076400 0.094832 0.093681 0.088606 0.080621 0.078769 0.084539 0.084911
qa: -0.1204 -0.1132 -0.4214 0.6263 -0.3320 -0.3198 0.1519 -0.2980 -0.2970 -0.2774 -0.1277 0.0276 0.0276 -0.2436 -0.2268 0.0922 0.1064 0.0533 0.0968 0.0865 0.0982 0.1027 0.1043 0.0843 0.1529 0.0979 0.0945 0.0918 0.0764 0.0948 0.0937 0.0886 0.0806 0.0788 0.0845 0.0849
va: 2.2601 2.3187 2.0090 5.4226 2.1158 2.1257 3.9497 3.9109 3.9441 3.8716 3.9819 3.8885 3.9098 3.9123 3.9258 1.0131 1.0085 1.0364 1.0052 1.0062 1.0149 1.0124 1.0134 1.0069 1.0015 1.0664 0.9911 1.0134 1.0092 0.9951 1.0041 1.0164 0.9989 1.0118 1.0049 1.0207
dispcorr: -0.018370009 hartree
energy: -2042.200110694855
dipole: 7.96572 -8.46037 -0.49464 -5.64295 5.50676 -0.13619 -10.32207 9.94830 -0.37377
magnitude: 0.63476 au
magnitude: 1.61344 debye
