program: Orca
programVersion: 5.0.2
elementType: S S S P O O C C C C C C C C C H H H H H H H H H H H H H H H H H H H H H
charge: 0
multiplicity: 1
keywords: wb97x-d3
keywords: def2-TZVPP
keywords: def2/J RIJCOSX
keywords: DEFGRID2
keywords: scfconv7
keywords: smallprint printgap noloewdin
keywords: NOSOSCF
formula: C9H21O2PS3
InChI: InChI=1/C9H21O2PS3/c1-6-10-12(13,11-7-2)15-8-14-9(3,4)5/h6-8H2,1-5H3
36 atoms
S  2.787599 -0.154706 0.968399
S  -0.199246 -0.025603 1.249003
S  -0.999995 0.911449 -1.915412
P  -1.665695 0.489961 -0.155832
O  -2.666457 -0.744601 0.000855
O  -2.614868 1.587491 0.511915
C  2.992973 -1.220974 -0.519393
C  4.173041 -2.117093 -0.148499
C  1.755115 -2.065125 -0.79175
C  3.33811 -0.371912 -1.736456
C  1.308933 0.799976 0.620076
C  -2.337263 -2.038309 -0.520422
C  -2.498304 2.980953 0.224018
C  -2.187066 -3.038711 0.601315
C  -1.270195 3.607444 0.847191
H  4.411509 -2.775621 -0.985723
H  5.067121 -1.534634 0.079367
H  3.944792 -2.742117 0.715382
H  0.913697 -1.453996 -1.119279
H  1.448374 -2.627205 0.089888
H  1.970973 -2.775537 -1.593767
H  2.518634 0.290942 -2.017654
H  4.224669 0.236102 -1.559191
H  3.533507 -1.016559 -2.596815
H  1.41816 1.755358 1.130132
H  1.189606 0.993246 -0.447049
H  -3.154421 -2.316817 -1.186856
H  -1.42891 -1.993817 -1.127618
H  -2.502701 3.135535 -0.857392
H  -3.40584 3.424203 0.632223
H  -1.33741 -2.796715 1.238987
H  -3.083853 -3.079394 1.21905
H  -2.023059 -4.032304 0.182881
H  -1.3074 4.689439 0.718543
H  -1.210808 3.394742 1.914091
H  -0.355953 3.256407 0.367723
totalener: -2042.17998413 hartree
nucrepener: 1721.94900947 hartree
electener: -3764.12899360 hartree
oneelecener: -6238.45583982 hartree
twoeener: 2474.32684622 hartree
kineticenergy: 2037.00805610 hartree
xcener: -124.869032330662 hartree
chargesum: 0.0000000
charge: -0.120298 -0.140199 -0.408254 0.622764 -0.311058 -0.310938 0.151366 -0.279534 -0.288569 -0.297801 -0.137770 0.010326 0.026129 -0.219874 -0.255194 0.085005 0.102822 0.104767 0.046389 0.101878 0.092341 0.097667 0.097774 0.087163 0.146699 0.108358 0.103831 0.079042 0.094323 0.095815 0.074649 0.093183 0.081939 0.092279 0.101162 0.071817
qa: -0.1203 -0.1402 -0.4083 0.6228 -0.3111 -0.3109 0.1514 -0.2795 -0.2886 -0.2978 -0.1378 0.0103 0.0261 -0.2199 -0.2552 0.0850 0.1028 0.1048 0.0464 0.1019 0.0923 0.0977 0.0978 0.0872 0.1467 0.1084 0.1038 0.0790 0.0943 0.0958 0.0746 0.0932 0.0819 0.0923 0.1012 0.0718
va: 2.2681 2.3129 2.0334 5.4522 2.1403 2.1465 3.9556 3.8744 3.9163 3.9459 3.9982 3.9167 3.8899 3.9199 3.8898 1.0068 1.0126 1.0129 1.0361 1.0103 1.0139 1.0050 1.0150 1.0060 0.9945 1.0642 0.9981 0.9992 1.0121 0.9926 1.0196 1.0069 1.0096 1.0151 1.0035 1.0148
dispcorr: -0.019139062 hartree
energy: -2042.199123194267
dipole: 12.23308 -12.14189 0.09119 -8.08290 7.93386 -0.14904 -4.13945 4.06639 -0.07306
magnitude: 0.18939 au
magnitude: 0.48139 debye
