program: Orca
programVersion: 5.0.2
elementType: S S S P O O C C C C C C C C C H H H H H H H H H H H H H H H H H H H H H
charge: 0
multiplicity: 1
keywords: wb97x-d3
keywords: def2-TZVPP
keywords: def2/J RIJCOSX
keywords: DEFGRID2
keywords: scfconv7
keywords: smallprint printgap noloewdin
keywords: NOSOSCF
formula: C9H21O2PS3
InChI: InChI=1/C9H21O2PS3/c1-6-10-12(13,11-7-2)15-8-14-9(3,4)5/h6-8H2,1-5H3
36 atoms
S  2.729011 -0.087369 1.148819
S  -0.276844 0.022198 1.289708
S  -0.871324 0.834424 -1.951826
P  -1.655281 0.45043 -0.231621
O  -2.637805 -0.802327 -0.114146
O  -2.67803 1.540364 0.33476
C  3.013266 -1.167237 -0.316509
C  1.805529 -2.043374 -0.62016
C  3.385224 -0.329153 -1.533565
C  4.198322 -2.032264 0.109339
C  1.257749 0.847648 0.723998
C  -2.284915 -2.088487 -0.638615
C  -2.564019 2.928616 0.019685
C  -2.040317 -3.079548 0.475342
C  -1.386733 3.5922 0.700303
H  2.064084 -2.756244 -1.407335
H  1.484546 -2.604466 0.257028
H  0.961133 -1.456173 -0.980977
H  4.253037 0.298858 -1.334311
H  2.563646 0.312119 -1.855259
H  3.624374 -0.982957 -2.375858
H  5.071841 -1.427628 0.358053
H  3.953659 -2.649251 0.974555
H  4.478483 -2.698169 -0.708935
H  1.335858 1.809285 1.227817
H  1.186628 1.02884 -0.34938
H  -3.126054 -2.400284 -1.258679
H  -1.413712 -2.011658 -1.294936
H  -2.50374 3.056278 -1.0638
H  -3.501976 3.366577 0.359301
H  -1.866551 -4.067603 0.047815
H  -1.165902 -2.809605 1.066289
H  -2.900235 -3.149284 1.140608
H  -0.438983 3.246295 0.286607
H  -1.434328 4.669724 0.541192
H  -1.389115 3.407444 1.774064
totalener: -2042.17971312 hartree
nucrepener: 1724.81772991 hartree
electener: -3766.99744303 hartree
oneelecener: -6244.20490069 hartree
twoeener: 2477.20745766 hartree
kineticenergy: 2037.00219942 hartree
xcener: -124.868375979068 hartree
chargesum: -0.0000000
charge: -0.120040 -0.139886 -0.409903 0.625595 -0.310817 -0.311277 0.152593 -0.285187 -0.298202 -0.280577 -0.138820 0.015902 0.025177 -0.222532 -0.255248 0.092018 0.101799 0.043036 0.097892 0.097794 0.086932 0.102847 0.104720 0.085139 0.147177 0.108231 0.103615 0.075968 0.094349 0.096427 0.083327 0.071448 0.094688 0.072062 0.092568 0.101185
qa: -0.1200 -0.1399 -0.4099 0.6256 -0.3108 -0.3113 0.1526 -0.2852 -0.2982 -0.2806 -0.1388 0.0159 0.0252 -0.2225 -0.2552 0.0920 0.1018 0.0430 0.0979 0.0978 0.0869 0.1028 0.1047 0.0851 0.1472 0.1082 0.1036 0.0760 0.0943 0.0964 0.0833 0.0714 0.0947 0.0721 0.0926 0.1012
va: 2.2688 2.3096 2.0312 5.4458 2.1434 2.1452 3.9548 3.9165 3.9449 3.8747 3.9958 3.9092 3.8903 3.9170 3.8890 1.0145 1.0095 1.0379 1.0151 1.0054 1.0061 1.0129 1.0127 1.0067 0.9943 1.0658 0.9957 1.0032 1.0114 0.9925 1.0096 1.0208 1.0072 1.0146 1.0150 1.0039
dispcorr: -0.019324273 hartree
energy: -2042.199037389703
dipole: 12.52344 -12.45931 0.06413 -7.88133 7.75151 -0.12982 -3.74868 3.64546 -0.10322
magnitude: 0.17782 au
magnitude: 0.45199 debye
