program: Orca
programVersion: 5.0.2
elementType: S S S P O O C C C C C C C C C H H H H H H H H H H H H H H H H H H H H H
charge: 0
multiplicity: 1
keywords: wb97x-d3
keywords: def2-TZVPP
keywords: def2/J RIJCOSX
keywords: DEFGRID2
keywords: scfconv7
keywords: smallprint printgap noloewdin
keywords: NOSOSCF
formula: C9H21O2PS3
InChI: InChI=1/C9H21O2PS3/c1-6-10-12(13,11-7-2)15-8-14-9(3,4)5/h6-8H2,1-5H3
36 atoms
S  1.961956 0.118774 -1.031865
S  -0.114137 -1.604424 0.512295
S  -1.777006 0.377596 -1.712268
P  -1.38948 -0.003845 0.133982
O  -2.6499 -0.390002 1.050977
O  -0.722935 1.164564 0.993428
C  3.351237 -0.032277 0.165682
C  4.297578 -1.151803 -0.249843
C  4.057958 1.317704 0.052404
C  2.856978 -0.236768 1.591984
C  1.044578 -1.416276 -0.892895
C  -3.817106 -1.028886 0.523236
C  -1.119419 2.532266 0.811874
C  -3.595495 -2.487154 0.188592
C  -0.045793 3.295688 0.075028
H  3.817824 -2.130998 -0.20939
H  4.672523 -1.001567 -1.261841
H  5.153565 -1.191295 0.428256
H  3.399718 2.136329 0.346355
H  4.407019 1.509426 -0.963217
H  4.927419 1.334651 0.712384
H  2.401437 -1.215417 1.735143
H  3.700076 -0.16359 2.283923
H  2.116152 0.511969 1.869009
H  0.46857 -1.502521 -1.81377
H  1.705553 -2.281094 -0.830538
H  -4.568845 -0.921834 1.304883
H  -4.163223 -0.483158 -0.357583
H  -2.06785 2.594622 0.272568
H  -1.280593 2.934267 1.812787
H  -2.90838 -2.607121 -0.648174
H  -3.200728 -3.03958 1.040639
H  -4.54673 -2.938471 -0.095273
H  0.102884 2.888228 -0.923359
H  -0.338244 4.342262 -0.018038
H  0.904166 3.254907 0.607613
totalener: -2042.17924525 hartree
nucrepener: 1743.72724133 hartree
electener: -3785.90648658 hartree
oneelecener: -6282.65781080 hartree
twoeener: 2496.75132421 hartree
kineticenergy: 2037.02089076 hartree
xcener: -124.868983208088 hartree
chargesum: -0.0000000
charge: -0.112520 -0.145341 -0.411407 0.626021 -0.336744 -0.305450 0.145147 -0.302006 -0.276738 -0.296161 -0.159898 0.020241 0.032794 -0.242930 -0.237350 0.084346 0.101653 0.088255 0.100385 0.104024 0.085095 0.086244 0.089274 0.100625 0.157045 0.130195 0.093468 0.091649 0.080159 0.094317 0.084129 0.088970 0.087137 0.093983 0.087948 0.073443
qa: -0.1125 -0.1453 -0.4114 0.6260 -0.3367 -0.3054 0.1451 -0.3020 -0.2767 -0.2962 -0.1599 0.0202 0.0328 -0.2429 -0.2374 0.0843 0.1017 0.0883 0.1004 0.1040 0.0851 0.0862 0.0893 0.1006 0.1570 0.1302 0.0935 0.0916 0.0802 0.0943 0.0841 0.0890 0.0871 0.0940 0.0879 0.0734
va: 2.2668 2.2818 2.0209 5.4251 2.1162 2.1168 3.9343 3.9332 3.8790 3.9150 4.0118 3.9021 3.8786 3.8896 3.9367 1.0080 1.0148 1.0066 1.0107 1.0125 1.0078 1.0130 1.0093 1.0213 1.0207 1.0078 0.9907 1.0139 1.0154 0.9954 1.0207 1.0045 1.0138 1.0120 1.0153 1.0035
dispcorr: -0.018681714 hartree
energy: -2042.197926965188
dipole: 14.68816 -14.42471 0.26345 2.71124 -2.84590 -0.13467 5.07957 -4.40600 0.67356
magnitude: 0.73568 au
magnitude: 1.86996 debye
