program: Orca
programVersion: 5.0.2
elementType: S S S P O O C C C C C C C C C H H H H H H H H H H H H H H H H H H H H H
charge: 0
multiplicity: 1
keywords: wb97x-d3
keywords: def2-TZVPP
keywords: def2/J RIJCOSX
keywords: DEFGRID2
keywords: scfconv7
keywords: smallprint printgap noloewdin
keywords: NOSOSCF
formula: C9H21O2PS3
InChI: InChI=1/C9H21O2PS3/c1-6-10-12(13,11-7-2)15-8-14-9(3,4)5/h6-8H2,1-5H3
36 atoms
S  2.470644 -1.726084 0.406435
S  -0.25238 -0.617309 1.029511
S  -0.795257 1.14073 -1.833694
P  -1.55158 0.484801 -0.196436
O  -2.865322 -0.38237 -0.438102
O  -2.072236 1.554459 0.882812
C  3.379572 -0.250467 -0.220476
C  2.736994 1.049362 0.244462
C  4.770092 -0.400628 0.393875
C  3.472367 -0.292246 -1.740782
C  0.797903 -1.483828 -0.197238
C  -3.544241 -1.082538 0.614576
C  -1.223823 2.632669 1.305814
C  -3.407209 -2.573683 0.419021
C  -1.568271 3.909429 0.575983
H  3.365667 1.892109 -0.054277
H  1.756069 1.205424 -0.205792
H  2.625683 1.073623 1.328171
H  4.733763 -0.365662 1.48301
H  5.409522 0.416048 0.053704
H  5.244492 -1.337421 0.097613
H  3.94008 -1.214036 -2.085332
H  2.493406 -0.207803 -2.214389
H  4.070645 0.548525 -2.100373
H  0.780283 -0.923053 -1.133236
H  0.372865 -2.468043 -0.384995
H  -3.164928 -0.790402 1.596725
H  -4.588303 -0.771525 0.564579
H  -1.384824 2.734254 2.379573
H  -0.170771 2.373047 1.15889
H  -2.367949 -2.887401 0.514224
H  -3.985307 -3.09934 1.179585
H  -3.776899 -2.881894 -0.558196
H  -2.615868 4.174462 0.715238
H  -0.959604 4.726817 0.964274
H  -1.371162 3.816076 -0.49057
totalener: -2042.18069509 hartree
nucrepener: 1707.22663258 hartree
electener: -3749.40732767 hartree
oneelecener: -6209.08606637 hartree
twoeener: 2459.67873870 hartree
kineticenergy: 2036.99240169 hartree
xcener: -124.863351767697 hartree
chargesum: -0.0000000
charge: -0.122685 -0.169803 -0.381526 0.633618 -0.308892 -0.328239 0.148610 -0.280001 -0.278634 -0.298435 -0.115989 0.013153 0.027163 -0.213254 -0.221624 0.091113 0.045981 0.100573 0.103906 0.085021 0.102873 0.097606 0.098347 0.086582 0.101266 0.142276 0.079753 0.096431 0.096916 0.075225 0.068821 0.080734 0.092952 0.084811 0.077456 0.087897
qa: -0.1227 -0.1698 -0.3815 0.6336 -0.3089 -0.3282 0.1486 -0.2800 -0.2786 -0.2984 -0.1160 0.0132 0.0272 -0.2133 -0.2216 0.0911 0.0460 0.1006 0.1039 0.0850 0.1029 0.0976 0.0983 0.0866 0.1013 0.1423 0.0798 0.0964 0.0969 0.0752 0.0688 0.0807 0.0930 0.0848 0.0775 0.0879
va: 2.2564 2.2834 2.0605 5.4249 2.1496 2.0930 3.9531 3.8905 3.8710 3.9471 3.9844 3.9259 3.9170 3.9211 3.9241 1.0146 1.0547 1.0120 1.0132 1.0067 1.0124 1.0148 1.0052 1.0061 1.0739 0.9995 1.0019 0.9956 0.9943 0.9955 1.0156 1.0123 1.0042 1.0067 1.0102 1.0256
dispcorr: -0.018223578 hartree
energy: -2042.198918666234
dipole: 11.42064 -11.50966 -0.08902 4.00063 -3.88846 0.11217 2.31690 -1.50043 0.81647
magnitude: 0.82893 au
magnitude: 2.10698 debye
