program: Orca
programVersion: 5.0.2
elementType: S S S P O O C C C C C C C C C H H H H H H H H H H H H H H H H H H H H H
charge: 0
multiplicity: 1
keywords: wb97x-d3
keywords: def2-TZVPP
keywords: def2/J RIJCOSX
keywords: DEFGRID2
keywords: scfconv7
keywords: smallprint printgap noloewdin
keywords: NOSOSCF
formula: C9H21O2PS3
InChI: InChI=1/C9H21O2PS3/c1-6-10-12(13,11-7-2)15-8-14-9(3,4)5/h6-8H2,1-5H3
36 atoms
S  1.995976 0.3476 -0.94446
S  0.015273 -1.369421 0.697981
S  -1.68395 0.402921 -1.62089
P  -1.567252 -0.059055 0.242515
O  -2.812531 -0.814766 0.900189
O  -1.48905 1.110642 1.322283
C  3.547526 0.0586 0.005451
C  3.270949 -0.353482 1.445174
C  4.410731 -0.98281 -0.696394
C  4.242839 1.418447 -0.024394
C  1.083758 -1.190933 -0.770163
C  -3.519307 -1.818558 0.161273
C  -0.38321 2.014568 1.418606
C  -4.783629 -1.252309 -0.44195
C  -0.462793 3.153018 0.42748
H  4.212251 -0.414758 1.99708
H  2.626703 0.363096 1.953708
H  2.793131 -1.330529 1.512816
H  4.631579 -0.688863 -1.721971
H  3.931169 -1.962536 -0.723752
H  5.357588 -1.107243 -0.165259
H  4.434252 1.75194 -1.045291
H  3.646778 2.182771 0.475578
H  5.203878 1.353789 0.489512
H  0.458196 -1.28445 -1.656768
H  1.756069 -2.048789 -0.744069
H  -2.881361 -2.24919 -0.61559
H  -3.743203 -2.609887 0.876766
H  -0.42132 2.389165 2.44137
H  0.556209 1.468588 1.296619
H  -4.554835 -0.485599 -1.180435
H  -5.341024 -2.047162 -0.938865
H  -5.426141 -0.818972 0.323864
H  0.330123 3.869151 0.646497
H  -0.330214 2.807378 -0.59538
H  -1.416396 3.675326 0.496971
totalener: -2042.17936795 hartree
nucrepener: 1726.30534777 hartree
electener: -3768.48471572 hartree
oneelecener: -6247.50232622 hartree
twoeener: 2479.01761050 hartree
kineticenergy: 2037.01402873 hartree
xcener: -124.870244354440 hartree
chargesum: -0.0000000
charge: -0.125109 -0.164671 -0.400259 0.622835 -0.318596 -0.301268 0.152446 -0.312297 -0.292660 -0.280583 -0.151505 0.028052 0.079196 -0.224794 -0.237980 0.097316 0.108081 0.083315 0.101262 0.086783 0.088315 0.105526 0.099693 0.086457 0.155147 0.127970 0.073514 0.095212 0.098248 0.010231 0.086243 0.076970 0.086164 0.076698 0.090173 0.093876
qa: -0.1251 -0.1647 -0.4003 0.6228 -0.3186 -0.3013 0.1524 -0.3123 -0.2927 -0.2806 -0.1515 0.0281 0.0792 -0.2248 -0.2380 0.0973 0.1081 0.0833 0.1013 0.0868 0.0883 0.1055 0.0997 0.0865 0.1551 0.1280 0.0735 0.0952 0.0982 0.0102 0.0862 0.0770 0.0862 0.0767 0.0902 0.0939
va: 2.2696 2.2866 2.0391 5.4564 2.1329 2.1575 3.9118 3.9444 3.9330 3.8911 3.9945 3.8962 3.8868 3.9300 3.9103 1.0090 0.9970 1.0068 1.0154 1.0084 1.0064 1.0112 1.0100 1.0070 1.0313 1.0120 1.0149 0.9934 0.9930 1.0455 1.0223 1.0102 1.0053 1.0110 1.0208 1.0100
dispcorr: -0.018183131 hartree
energy: -2042.197551076571
dipole: 16.29971 -15.39697 0.90274 2.81393 -3.27528 -0.46134 2.49711 -1.97756 0.51955
magnitude: 1.13917 au
magnitude: 2.89554 debye
