program: Orca
programVersion: 5.0.2
elementType: S S S P O O C C C C C C C C C H H H H H H H H H H H H H H H H H H H H H
charge: 0
multiplicity: 1
keywords: wb97x-d3
keywords: def2-TZVPP
keywords: def2/J RIJCOSX
keywords: DEFGRID2
keywords: scfconv7
keywords: smallprint printgap noloewdin
keywords: NOSOSCF
formula: C9H21O2PS3
InChI: InChI=1/C9H21O2PS3/c1-6-10-12(13,11-7-2)15-8-14-9(3,4)5/h6-8H2,1-5H3
36 atoms
S  1.776153 -1.236332 0.728326
S  0.058668 0.983344 1.714058
S  -0.716593 0.977574 -1.616675
P  -1.266559 0.503947 0.167666
O  -1.602032 -1.029898 0.441706
O  -2.594567 1.21436 0.716078
C  3.149896 -1.396562 -0.487255
C  4.389193 -0.652626 -0.005383
C  3.424799 -2.897602 -0.536051
C  2.713759 -0.903133 -1.860725
C  1.623898 0.5568 0.906633
C  -1.803886 -1.979496 -0.609779
C  -3.034062 2.494823 0.249402
C  -3.169199 -1.844983 -1.245031
C  -2.208508 3.638896 0.79291
H  4.690029 -0.982955 0.989104
H  5.22304 -0.831747 -0.688525
H  4.231691 0.426541 0.02792
H  2.54188 -3.456004 -0.851267
H  3.741504 -3.281506 0.434305
H  4.219832 -3.102971 -1.255767
H  2.463051 0.157646 -1.862588
H  3.520671 -1.049098 -2.583495
H  1.835791 -1.4423 -2.214181
H  2.398726 0.967396 1.55459
H  1.664225 1.060242 -0.06009
H  -1.012057 -1.87439 -1.354481
H  -1.686821 -2.951107 -0.13162
H  -3.030098 2.505262 -0.843019
H  -4.068138 2.570389 0.58423
H  -3.266614 -0.899612 -1.778421
H  -3.318088 -2.648543 -1.967162
H  -3.962013 -1.909695 -0.5006
H  -1.189649 3.617367 0.408102
H  -2.660077 4.58309 0.48625
H  -2.166853 3.622623 1.881466
totalener: -2042.17980060 hartree
nucrepener: 1731.68549029 hartree
electener: -3773.86529089 hartree
oneelecener: -6258.45339131 hartree
twoeener: 2484.58810041 hartree
kineticenergy: 2037.00867214 hartree
xcener: -124.868845222575 hartree
chargesum: 0.0000000
charge: -0.122053 -0.125313 -0.417085 0.623313 -0.307616 -0.333335 0.149937 -0.306175 -0.275513 -0.296648 -0.145447 0.040054 0.026846 -0.231462 -0.245596 0.102409 0.089621 0.082409 0.099301 0.103452 0.084327 0.089525 0.090927 0.095455 0.135154 0.122012 0.075547 0.098354 0.088845 0.095443 0.079895 0.080806 0.090728 0.084735 0.086508 0.090641
qa: -0.1221 -0.1253 -0.4171 0.6233 -0.3076 -0.3333 0.1499 -0.3062 -0.2755 -0.2966 -0.1454 0.0401 0.0268 -0.2315 -0.2456 0.1024 0.0896 0.0824 0.0993 0.1035 0.0843 0.0895 0.0909 0.0955 0.1352 0.1220 0.0755 0.0984 0.0888 0.0954 0.0799 0.0808 0.0907 0.0847 0.0865 0.0906
va: 2.2354 2.3124 2.0138 5.4226 2.1256 2.1146 3.9150 3.9230 3.8756 3.9565 4.0193 3.8818 3.8902 3.9258 3.9005 1.0127 1.0085 1.0042 1.0130 1.0135 1.0071 1.0094 1.0097 1.0100 0.9980 1.0298 1.0170 0.9912 1.0136 0.9906 1.0212 1.0109 1.0062 1.0199 1.0140 1.0036
dispcorr: -0.018109971 hartree
energy: -2042.197910575601
dipole: 10.52542 -10.30639 0.21903 -5.14829 5.18766 0.03937 -9.72344 9.42172 -0.30173
magnitude: 0.37492 au
magnitude: 0.95296 debye
