program: Orca
programVersion: 5.0.2
elementType: S S S P O O C C C C C C C C C H H H H H H H H H H H H H H H H H H H H H
charge: 0
multiplicity: 1
keywords: wb97x-d3
keywords: def2-TZVPP
keywords: def2/J RIJCOSX
keywords: DEFGRID2
keywords: scfconv7
keywords: smallprint printgap noloewdin
keywords: NOSOSCF
formula: C9H21O2PS3
InChI: InChI=1/C9H21O2PS3/c1-6-10-12(13,11-7-2)15-8-14-9(3,4)5/h6-8H2,1-5H3
36 atoms
S  1.777927 -1.232524 0.735163
S  0.05697 0.988425 1.711648
S  -0.712114 0.97778 -1.617605
P  -1.266395 0.503756 0.165665
O  -1.599469 -1.029757 0.442334
O  -2.596107 1.212444 0.711571
C  3.147618 -1.398313 -0.483758
C  4.386387 -0.645843 -0.013355
C  3.428246 -2.898807 -0.521187
C  2.705238 -0.917539 -1.859898
C  1.623568 0.561053 0.906695
C  -1.80275 -1.98052 -0.607507
C  -3.034258 2.494143 0.247672
C  -3.168782 -1.845873 -1.241407
C  -2.208096 3.636687 0.793504
H  5.219507 -0.831529 -0.695583
H  4.226378 0.433173 0.006947
H  4.689452 -0.963633 0.984458
H  2.544465 -3.463061 -0.822953
H  3.754383 -3.271457 0.450336
H  4.21768 -3.108949 -1.245561
H  2.446924 0.141291 -1.867901
H  3.510912 -1.062911 -2.58412
H  1.829974 -1.46517 -2.206856
H  2.397873 0.974206 1.553599
H  1.664343 1.060912 -0.061867
H  -1.011882 -1.876282 -1.35337
H  -1.685317 -2.951593 -0.128387
H  -3.030292 2.506833 -0.844778
H  -4.068363 2.569961 0.582422
H  -3.266068 -0.90085 -1.775485
H  -3.319005 -2.649941 -1.96265
H  -3.960702 -1.909202 -0.495917
H  -1.190055 3.616821 0.406431
H  -2.66054 4.581866 0.491598
H  -2.164012 3.615936 1.881842
totalener: -2042.17981235 hartree
nucrepener: 1731.91125110 hartree
electener: -3774.09106346 hartree
oneelecener: -6258.90280158 hartree
twoeener: 2484.81173812 hartree
kineticenergy: 2037.01041552 hartree
xcener: -124.869211488122 hartree
chargesum: 0.0000000
charge: -0.121998 -0.125547 -0.417076 0.623495 -0.307193 -0.333169 0.150045 -0.306498 -0.275251 -0.296606 -0.145450 0.039838 0.026809 -0.231504 -0.245885 0.089670 0.082441 0.102429 0.099116 0.103354 0.084330 0.089267 0.090933 0.095297 0.135294 0.121995 0.075585 0.098354 0.088840 0.095409 0.079897 0.080857 0.090806 0.084868 0.086613 0.090635
qa: -0.1220 -0.1255 -0.4171 0.6235 -0.3072 -0.3332 0.1500 -0.3065 -0.2753 -0.2966 -0.1454 0.0398 0.0268 -0.2315 -0.2459 0.0897 0.0824 0.1024 0.0991 0.1034 0.0843 0.0893 0.0909 0.0953 0.1353 0.1220 0.0756 0.0984 0.0888 0.0954 0.0799 0.0809 0.0908 0.0849 0.0866 0.0906
va: 2.2357 2.3123 2.0137 5.4228 2.1260 2.1149 3.9147 3.9228 3.8758 3.9570 4.0191 3.8823 3.8902 3.9256 3.9004 1.0086 1.0041 1.0127 1.0131 1.0135 1.0071 1.0096 1.0098 1.0098 0.9980 1.0299 1.0168 0.9912 1.0135 0.9906 1.0212 1.0109 1.0063 1.0198 1.0140 1.0036
dispcorr: -0.018120380 hartree
energy: -2042.197932732090
dipole: 10.49981 -10.28769 0.21212 -5.18629 5.22421 0.03791 -9.70088 9.39978 -0.30110
magnitude: 0.37026 au
magnitude: 0.94112 debye
