program: Orca
programVersion: 5.0.2
elementType: S S S P O O C C C C C C C C C H H H H H H H H H H H H H H H H H H H H H
charge: 0
multiplicity: 1
keywords: wb97x-d3
keywords: def2-TZVPP
keywords: def2/J RIJCOSX
keywords: DEFGRID2
keywords: scfconv7
keywords: smallprint printgap noloewdin
keywords: NOSOSCF
formula: C9H21O2PS3
InChI: InChI=1/C9H21O2PS3/c1-6-10-12(13,11-7-2)15-8-14-9(3,4)5/h6-8H2,1-5H3
36 atoms
S  2.10609 0.503833 -0.963606
S  0.244962 -1.829149 -0.069019
S  -1.59055 0.479257 -1.776139
P  -1.29752 -0.414007 -0.095598
O  -2.441208 -1.389737 0.448683
O  -1.080066 0.539481 1.174607
C  3.457621 0.196789 0.245497
C  2.924587 -0.31051 1.57967
C  4.492186 -0.763588 -0.326793
C  4.078482 1.581453 0.428559
C  1.375508 -1.101973 -1.301656
C  -3.822726 -1.186118 0.127707
C  -0.609882 1.890143 1.080358
C  -4.42112 0.021341 0.813888
C  -1.75902 2.870494 1.086301
H  2.50036 -1.309924 1.502596
H  3.737842 -0.349808 2.308684
H  2.146905 0.343528 1.973614
H  4.085882 -1.764621 -0.476832
H  5.329798 -0.865121 0.366606
H  4.882645 -0.408373 -1.280011
H  3.355734 2.293971 0.828283
H  4.908672 1.520408 1.134413
H  4.465514 1.979747 -0.509778
H  0.824665 -0.978845 -2.233957
H  2.137964 -1.863622 -1.466267
H  -3.934873 -1.106786 -0.956284
H  -4.317902 -2.10047 0.451919
H  0.032189 2.036314 1.950034
H  0.00597 2.021417 0.190026
H  -5.497238 0.038755 0.637807
H  -4.254441 -0.006543 1.889939
H  -4.010879 0.951044 0.421977
H  -2.361726 2.770031 0.184527
H  -2.399268 2.734634 1.957529
H  -1.367575 3.888254 1.11209
totalener: -2042.17788720 hartree
nucrepener: 1735.98488639 hartree
electener: -3778.16277359 hartree
oneelecener: -6266.97896198 hartree
twoeener: 2488.81618838 hartree
kineticenergy: 2037.01867791 hartree
xcener: -124.871038571908 hartree
chargesum: -0.0000000
charge: -0.125379 -0.138307 -0.408273 0.618050 -0.326392 -0.308828 0.149758 -0.307779 -0.306826 -0.277775 -0.171168 0.016900 0.041963 -0.239053 -0.265708 0.095713 0.092329 0.099183 0.085932 0.089584 0.104314 0.098540 0.085986 0.105379 0.159325 0.135790 0.091904 0.093656 0.085500 0.096077 0.087847 0.092575 0.081336 0.086631 0.091330 0.089888
qa: -0.1254 -0.1383 -0.4083 0.6180 -0.3264 -0.3088 0.1498 -0.3078 -0.3068 -0.2778 -0.1712 0.0169 0.0420 -0.2391 -0.2657 0.0957 0.0923 0.0992 0.0859 0.0896 0.1043 0.0985 0.0860 0.1054 0.1593 0.1358 0.0919 0.0937 0.0855 0.0961 0.0878 0.0926 0.0813 0.0866 0.0913 0.0899
va: 2.2607 2.2982 2.0183 5.4179 2.1346 2.0871 3.9195 3.9293 3.9280 3.8766 4.0152 3.9125 3.8389 3.8910 3.9597 1.0184 1.0082 1.0074 1.0067 1.0069 1.0135 1.0119 1.0074 1.0131 1.0198 1.0052 1.0093 0.9910 0.9911 1.0142 1.0132 1.0067 1.0115 1.0140 0.9999 1.0149
dispcorr: -0.018866017 hartree
energy: -2042.196753217284
dipole: 10.27465 -9.89222 0.38243 9.93895 -9.80403 0.13492 10.34875 -9.61098 0.73776
magnitude: 0.84187 au
magnitude: 2.13987 debye
