program: Orca
programVersion: 5.0.2
elementType: S S S P O O C C C C C C C C C H H H H H H H H H H H H H H H H H H H H H
charge: 0
multiplicity: 1
keywords: wb97x-d3
keywords: def2-TZVPP
keywords: def2/J RIJCOSX
keywords: DEFGRID2
keywords: scfconv7
keywords: smallprint printgap noloewdin
keywords: NOSOSCF
formula: C9H21O2PS3
InChI: InChI=1/C9H21O2PS3/c1-6-10-12(13,11-7-2)15-8-14-9(3,4)5/h6-8H2,1-5H3
36 atoms
S  2.109452 0.145487 -1.04276
S  0.103504 -1.657048 0.507304
S  -1.679223 0.086686 -1.796845
P  -1.338989 -0.21275 0.072882
O  -2.56021 -0.765114 0.953204
O  -0.886241 1.038959 0.947817
C  3.396265 0.106531 0.276663
C  2.800876 0.475746 1.630866
C  4.091665 -1.2461 0.340264
C  4.389589 1.180584 -0.164218
C  1.23061 -1.412408 -0.910308
C  -3.400174 -1.815232 0.456362
C  -1.222829 2.393985 0.623698
C  -4.714899 -1.256368 -0.034688
C  0.026373 3.239217 0.678902
H  2.321026 1.45301 1.595779
H  2.054094 -0.245386 1.95765
H  3.590677 0.51157 2.386157
H  4.945478 -1.187494 1.018937
H  4.462582 -1.55586 -0.637484
H  3.436081 -2.027136 0.727643
H  4.851803 0.933826 -1.120196
H  3.909438 2.155905 -0.262207
H  5.181569 1.279007 0.581079
H  0.641482 -1.489895 -1.824302
H  1.913544 -2.260646 -0.881504
H  -2.896745 -2.36963 -0.340616
H  -3.549074 -2.502232 1.290064
H  -1.674508 2.444377 -0.36934
H  -1.964061 2.730281 1.351162
H  -5.228196 -0.705294 0.753014
H  -4.562085 -0.592439 -0.884366
H  -5.365605 -2.071179 -0.353785
H  0.750296 2.903254 -0.062769
H  -0.22506 4.27928 0.469272
H  0.491881 3.198798 1.663608
totalener: -2042.18043121 hartree
nucrepener: 1731.42269821 hartree
electener: -3773.60312942 hartree
oneelecener: -6257.91138441 hartree
twoeener: 2484.30825499 hartree
kineticenergy: 2037.01566434 hartree
xcener: -124.868225689345 hartree
chargesum: -0.0000000
charge: -0.117114 -0.161039 -0.409060 0.632425 -0.333082 -0.302511 0.152133 -0.298202 -0.322064 -0.274882 -0.160274 0.024126 0.041476 -0.226716 -0.251036 0.087215 0.102724 0.090376 0.091495 0.104799 0.083975 0.103421 0.099290 0.083634 0.162787 0.136437 0.079332 0.095528 0.084909 0.094050 0.083763 0.084881 0.077835 0.084015 0.091517 0.083836
qa: -0.1171 -0.1610 -0.4091 0.6324 -0.3331 -0.3025 0.1521 -0.2982 -0.3221 -0.2749 -0.1603 0.0241 0.0415 -0.2267 -0.2510 0.0872 0.1027 0.0904 0.0915 0.1048 0.0840 0.1034 0.0993 0.0836 0.1628 0.1364 0.0793 0.0955 0.0849 0.0941 0.0838 0.0849 0.0778 0.0840 0.0915 0.0838
va: 2.2744 2.2884 2.0306 5.4378 2.1129 2.1320 3.9167 3.9268 3.9299 3.8858 4.0078 3.8993 3.8459 3.9333 3.9305 1.0117 1.0249 1.0089 1.0093 1.0104 1.0017 1.0155 1.0097 1.0075 1.0210 0.9987 1.0130 0.9932 1.0221 0.9942 1.0045 1.0228 1.0113 1.0168 1.0156 1.0002
dispcorr: -0.018353862 hartree
energy: -2042.198785072140
dipole: 12.56506 -12.27647 0.28859 6.30831 -6.43991 -0.13161 6.66400 -5.99654 0.66746
magnitude: 0.73899 au
magnitude: 1.87836 debye
