program: Orca
programVersion: 5.0.2
elementType: S S S P O O C C C C C C C C C H H H H H H H H H H H H H H H H H H H H H
charge: 0
multiplicity: 1
keywords: wb97x-d3
keywords: def2-TZVPP
keywords: def2/J RIJCOSX
keywords: DEFGRID2
keywords: scfconv7
keywords: smallprint printgap noloewdin
keywords: NOSOSCF
formula: C9H21O2PS3
InChI: InChI=1/C9H21O2PS3/c1-6-10-12(13,11-7-2)15-8-14-9(3,4)5/h6-8H2,1-5H3
36 atoms
S  1.6950 -1.349543 -0.895756
S  0.934819 1.499269 0.085996
S  -1.631701 0.378571 -1.820272
P  -1.043358 0.849927 -0.04952
O  -1.157296 -0.269125 1.079633
O  -1.787308 2.078007 0.666568
C  2.920946 -1.648428 0.447456
C  4.209207 -0.874102 0.208097
C  2.336881 -1.317722 1.816043
C  3.189725 -3.149617 0.347846
C  1.703459 0.422485 -1.174087
C  -2.132989 -1.319364 1.046716
C  -2.080823 3.275458 -0.066666
C  -1.457966 -2.630522 1.368116
C  -3.527202 3.296921 -0.501952
H  4.073538 0.199997 0.341967
H  4.96624 -1.187651 0.93069
H  4.606448 -1.051999 -0.792006
H  2.100009 -0.260229 1.913797
H  3.056248 -1.577197 2.597331
H  1.421251 -1.877756 1.999586
H  2.27353 -3.730625 0.468215
H  3.636241 -3.416827 -0.610186
H  3.876962 -3.454107 1.139881
H  2.714234 0.808188 -1.303483
H  1.167289 0.569211 -2.111957
H  -2.903686 -1.077829 1.781321
H  -2.604618 -1.364932 0.062651
H  -1.85935 4.10133 0.609823
H  -1.417174 3.372484 -0.930603
H  -0.70462 -2.868243 0.617908
H  -0.981231 -2.60618 2.347883
H  -2.199085 -3.43023 1.376583
H  -3.747194 4.24221 -0.999355
H  -3.735235 2.489493 -1.202506
H  -4.198064 3.202305 0.351429
totalener: -2042.18023301 hartree
nucrepener: 1734.49741193 hartree
electener: -3776.67764494 hartree
oneelecener: -6264.06739101 hartree
twoeener: 2487.38974607 hartree
kineticenergy: 2037.01368662 hartree
xcener: -124.868184703631 hartree
chargesum: 0.0000000
charge: -0.116405 -0.160768 -0.410447 0.635246 -0.302635 -0.334636 0.149647 -0.320208 -0.299882 -0.274308 -0.161755 0.040490 0.023246 -0.253112 -0.228507 0.083230 0.090976 0.105620 0.101616 0.090486 0.089833 0.099145 0.103880 0.083677 0.137149 0.163046 0.094744 0.085863 0.095801 0.080684 0.083741 0.084097 0.092676 0.078053 0.086211 0.083507
qa: -0.1164 -0.1608 -0.4104 0.6352 -0.3026 -0.3346 0.1496 -0.3202 -0.2999 -0.2743 -0.1618 0.0405 0.0232 -0.2531 -0.2285 0.0832 0.0910 0.1056 0.1016 0.0905 0.0898 0.0991 0.1039 0.0837 0.1371 0.1630 0.0947 0.0859 0.0958 0.0807 0.0837 0.0841 0.0927 0.0781 0.0862 0.0835
va: 2.2734 2.2889 2.0291 5.4350 2.1313 2.1129 3.9204 3.9281 3.9245 3.8839 4.0085 3.8445 3.8993 3.9322 3.9307 1.0019 1.0093 1.0112 1.0252 1.0090 1.0116 1.0098 1.0151 1.0076 0.9988 1.0204 0.9940 1.0220 0.9931 1.0122 1.0165 0.9999 1.0153 1.0112 1.0236 1.0045
dispcorr: -0.018443146 hartree
energy: -2042.198676157182
dipole: 8.23950 -7.88337 0.35613 -10.14438 10.24789 0.10350 8.68009 -8.02995 0.65014
magnitude: 0.74848 au
magnitude: 1.90248 debye
