program: Orca
programVersion: 5.0.2
elementType: S S S P O O C C C C C C C C C H H H H H H H H H H H H H H H H H H H H H
charge: 0
multiplicity: 1
keywords: wb97x-d3
keywords: def2-TZVPP
keywords: def2/J RIJCOSX
keywords: DEFGRID2
keywords: scfconv7
keywords: smallprint printgap noloewdin
keywords: NOSOSCF
formula: C9H21O2PS3
InChI: InChI=1/C9H21O2PS3/c1-6-10-12(13,11-7-2)15-8-14-9(3,4)5/h6-8H2,1-5H3
36 atoms
S  1.883744 -1.367888 -0.779507
S  0.948079 1.413109 0.253647
S  -1.407585 0.024483 -1.779625
P  -1.064594 0.978866 -0.145561
O  -1.606445 0.306268 1.204936
O  -1.693423 2.439501 -0.001055
C  3.258623 -1.629544 0.418764
C  4.54049 -0.951079 -0.0456
C  2.876879 -1.164224 1.818649
C  3.443397 -3.146757 0.40945
C  1.794252 0.40985 -1.016764
C  -1.318247 -1.067043 1.499545
C  -2.952047 2.774691 -0.600272
C  -2.547676 -1.918916 1.28597
C  -4.129236 2.114959 0.082869
H  4.798636 -1.237444 -1.065107
H  4.471112 0.136587 -0.001323
H  5.368545 -1.237887 0.60661
H  3.672313 -1.416383 2.524719
H  1.960105 -1.645789 2.158412
H  2.719751 -0.087758 1.866328
H  3.726616 -3.512951 -0.577785
H  4.231557 -3.4254 1.111644
H  2.532196 -3.6638 0.714297
H  2.786518 0.850315 -1.106208
H  1.281311 0.55756 -1.966208
H  -0.485213 -1.430929 0.890355
H  -0.997747 -1.09093 2.542124
H  -3.014186 3.859209 -0.519864
H  -2.927776 2.514655 -1.661373
H  -2.834996 -1.929804 0.235345
H  -2.342817 -2.945374 1.591565
H  -3.388463 -1.554486 1.875759
H  -4.130159 1.035878 -0.067477
H  -4.133836 2.315867 1.153281
H  -5.054439 2.507694 -0.340199
totalener: -2042.17928977 hartree
nucrepener: 1720.01833456 hartree
electener: -3762.19762434 hartree
oneelecener: -6235.02608933 hartree
twoeener: 2472.82846499 hartree
kineticenergy: 2037.00999233 hartree
xcener: -124.867077340040 hartree
chargesum: 0.0000000
charge: -0.111198 -0.146010 -0.401448 0.617158 -0.311771 -0.321374 0.157058 -0.315486 -0.307678 -0.277347 -0.171364 0.048695 0.009078 -0.238516 -0.223330 0.107416 0.085378 0.090138 0.093038 0.086957 0.098589 0.105117 0.084534 0.101109 0.141044 0.154482 0.060461 0.091709 0.094114 0.091158 0.087019 0.081983 0.086859 0.078913 0.089845 0.083672
qa: -0.1112 -0.1460 -0.4014 0.6172 -0.3118 -0.3214 0.1571 -0.3155 -0.3077 -0.2773 -0.1714 0.0487 0.0091 -0.2385 -0.2233 0.1074 0.0854 0.0901 0.0930 0.0870 0.0986 0.1051 0.0845 0.1011 0.1410 0.1545 0.0605 0.0917 0.0941 0.0912 0.0870 0.0820 0.0869 0.0789 0.0898 0.0837
va: 2.2852 2.2940 2.0378 5.4221 2.0972 2.1441 3.9133 3.9259 3.9273 3.8768 4.0169 3.8680 3.9170 3.9376 3.8886 1.0134 1.0042 1.0075 1.0097 1.0128 1.0191 1.0142 1.0071 1.0114 1.0039 1.0283 1.0399 0.9949 0.9905 1.0109 1.0191 1.0142 1.0040 1.0171 1.0075 1.0118
dispcorr: -0.018139480 hartree
energy: -2042.197429253057
dipole: 6.78032 -6.41591 0.36441 -12.18273 12.08288 -0.09985 9.74828 -9.04318 0.70510
magnitude: 0.79996 au
magnitude: 2.03334 debye
