program: Orca
programVersion: 5.0.2
elementType: S S S P O O C C C C C C C C C H H H H H H H H H H H H H H H H H H H H H
charge: 0
multiplicity: 1
keywords: wb97x-d3
keywords: def2-TZVPP
keywords: def2/J RIJCOSX
keywords: DEFGRID2
keywords: scfconv7
keywords: smallprint printgap noloewdin
keywords: NOSOSCF
formula: C9H21O2PS3
InChI: InChI=1/C9H21O2PS3/c1-6-10-12(13,11-7-2)15-8-14-9(3,4)5/h6-8H2,1-5H3
36 atoms
S  1.58881 -1.308106 -0.809064
S  0.715332 1.544157 0.072696
S  -1.848657 0.106796 -1.647615
P  -1.193467 0.72058 0.054833
O  -1.113091 -0.358148 1.229474
O  -2.029664 1.900234 0.754877
C  2.961402 -1.527482 0.396468
C  4.298205 -1.175528 -0.244311
C  2.739059 -0.722347 1.670376
C  2.910795 -3.021481 0.714766
C  1.536438 0.452934 -1.147481
C  -2.121861 -1.370323 1.372119
C  -2.845118 2.807602 0.005263
C  -1.590764 -2.712383 0.928224
C  -2.038474 3.80865 -0.79168
H  5.112136 -1.352989 0.462671
H  4.483365 -1.776526 -1.133956
H  4.351321 -0.123957 -0.530072
H  2.837898 0.349313 1.504099
H  3.484739 -1.007626 2.416964
H  1.748117 -0.898428 2.086853
H  3.709087 -3.275391 1.414692
H  1.961886 -3.297975 1.176532
H  3.044166 -3.632196 -0.179353
H  2.534472 0.872965 -1.274177
H  1.007834 0.556907 -2.094568
H  -2.392437 -1.378116 2.428577
H  -3.017659 -1.110666 0.802174
H  -3.507812 2.242289 -0.654329
H  -3.459773 3.309977 0.751777
H  -0.688861 -2.981443 1.477299
H  -2.34149 -3.481885 1.111486
H  -1.355025 -2.704536 -0.134286
H  -1.473415 3.322726 -1.586456
H  -2.715279 4.5262 -1.256769
H  -1.342963 4.359382 -0.159446
totalener: -2042.17899666 hartree
nucrepener: 1744.51724984 hartree
electener: -3786.69624650 hartree
oneelecener: -6284.23950537 hartree
twoeener: 2497.54325887 hartree
kineticenergy: 2037.02056379 hartree
xcener: -124.869105782946 hartree
chargesum: 0.0000000
charge: -0.112748 -0.142892 -0.412118 0.626431 -0.306108 -0.338166 0.146603 -0.300405 -0.296831 -0.278337 -0.161982 0.033306 0.022790 -0.239735 -0.242150 0.088296 0.100483 0.084256 0.085603 0.088933 0.101360 0.085501 0.101137 0.103511 0.131133 0.157457 0.094048 0.079526 0.089880 0.094207 0.073743 0.088251 0.095389 0.084527 0.086323 0.088779
qa: -0.1127 -0.1429 -0.4121 0.6264 -0.3061 -0.3382 0.1466 -0.3004 -0.2968 -0.2783 -0.1620 0.0333 0.0228 -0.2397 -0.2421 0.0883 0.1005 0.0843 0.0856 0.0889 0.1014 0.0855 0.1011 0.1035 0.1311 0.1575 0.0940 0.0795 0.0899 0.0942 0.0737 0.0883 0.0954 0.0845 0.0863 0.0888
va: 2.2667 2.2855 2.0178 5.4225 2.1165 2.1125 3.9295 3.9354 3.9155 3.8810 4.0096 3.8785 3.9006 3.9365 3.8897 1.0062 1.0148 1.0086 1.0120 1.0093 1.0214 1.0077 1.0101 1.0125 1.0072 1.0208 0.9955 1.0157 1.0135 0.9911 1.0033 1.0154 1.0114 1.0223 1.0140 1.0048
dispcorr: -0.018717835 hartree
energy: -2042.197714498307
dipole: 11.61622 -11.29866 0.31756 -8.22759 8.35719 0.12960 6.36185 -5.74210 0.61974
magnitude: 0.70832 au
magnitude: 1.80041 debye
